BDBM349569 US10207991, Ex. Cpd. No. 87::US10611728, Example Compound 87
SMILES: CC(C)COc1cc(CCC(C)(C)N2Cc3ccc(cc3C2)S(C)(=O)=O)ccc1O
InChI Key: InChIKey=NBTIJJVBAGEXFD-UHFFFAOYSA-N
Data: 6 KI  1 IC50
Activity Spreadsheet -- Enzyme Inhibition Constant Data from BindingDB
Found 7 hits for monomerid = 349569
Trg + Lig
Ki
nM
ΔG°
kcal/mole
IC50
nM
Kd
nM
EC50/IC50
nM
koff
s-1
kon
M-1s-1
pHTemp
°C
Sigma intracellular receptor 2
(Homo sapiens (Human))
BDBM349569
(US10207991, Ex. Cpd. No. 87 | US10611728, Example ...)
Show SMILES CC(C)COc1cc(CCC(C)(C)N2Cc3ccc(cc3C2)S(C)(=O)=O)ccc1O
Show InChI InChI=1S/C24H33NO4S/c1-17(2)16-29-23-12-18(6-9-22(23)26)10-11-24(3,4)25-14-19-7-8-21(30(5,27)28)13-20(19)15-25/h6-9,12-13,17,26H,10-11,14-16H2,1-5H3
US Patent
1.10n/an/an/an/an/an/an/an/a
COGNITION THERAPEUTICS, INC.
US Patent
Assay Description
Radioligand binding assays for Sigma-1 receptors and Sigma-2 receptors were carried out by a commercial contract research organization. For Sigma-1 b...
US Patent US9796672 (2017)
BindingDB Entry DOI: 10.7270/Q2X92DFN
Sigma intracellular receptor 2
(Homo sapiens (Human))
BDBM349569
(US10207991, Ex. Cpd. No. 87 | US10611728, Example ...)
Show SMILES CC(C)COc1cc(CCC(C)(C)N2Cc3ccc(cc3C2)S(C)(=O)=O)ccc1O
Show InChI InChI=1S/C24H33NO4S/c1-17(2)16-29-23-12-18(6-9-22(23)26)10-11-24(3,4)25-14-19-7-8-21(30(5,27)28)13-20(19)15-25/h6-9,12-13,17,26H,10-11,14-16H2,1-5H3
US Patent
1.10n/an/an/an/an/an/an/an/a
COGNITION THERAPEUTICS, INC.
US Patent
Assay Description
Radioligand binding assays for Sigma-1 receptors and Sigma-2 receptors were carried out by a commercial contract research organization. For Sigma-1 b...
US Patent US10611728 (2020)
Sigma intracellular receptor 2
(Homo sapiens (Human))
BDBM349569
(US10207991, Ex. Cpd. No. 87 | US10611728, Example ...)
Show SMILES CC(C)COc1cc(CCC(C)(C)N2Cc3ccc(cc3C2)S(C)(=O)=O)ccc1O
Show InChI InChI=1S/C24H33NO4S/c1-17(2)16-29-23-12-18(6-9-22(23)26)10-11-24(3,4)25-14-19-7-8-21(30(5,27)28)13-20(19)15-25/h6-9,12-13,17,26H,10-11,14-16H2,1-5H3
US Patent
1.10n/an/an/an/an/an/an/an/a
COGNITION THERAPEUTICS, INC.
US Patent
Assay Description
The affinity of candidate sigma-2 ligand compounds at sigma-1 and sigma-2 receptors was also determined by displacement of different known labeled si...
US Patent US10207991 (2019)
BindingDB Entry DOI: 10.7270/Q2BV7JRG
Sigma non-opioid intracellular receptor 1
(Homo sapiens (Human))
BDBM349569
(US10207991, Ex. Cpd. No. 87 | US10611728, Example ...)
Show SMILES CC(C)COc1cc(CCC(C)(C)N2Cc3ccc(cc3C2)S(C)(=O)=O)ccc1O
Show InChI InChI=1S/C24H33NO4S/c1-17(2)16-29-23-12-18(6-9-22(23)26)10-11-24(3,4)25-14-19-7-8-21(30(5,27)28)13-20(19)15-25/h6-9,12-13,17,26H,10-11,14-16H2,1-5H3
US Patent
69n/an/an/an/an/an/an/an/a
COGNITION THERAPEUTICS, INC.
US Patent
Assay Description
Radioligand binding assays for Sigma-1 receptors and Sigma-2 receptors were carried out by a commercial contract research organization. For Sigma-1 b...
US Patent US9796672 (2017)
BindingDB Entry DOI: 10.7270/Q2X92DFN
Sigma non-opioid intracellular receptor 1
(Homo sapiens (Human))
BDBM349569
(US10207991, Ex. Cpd. No. 87 | US10611728, Example ...)
Show SMILES CC(C)COc1cc(CCC(C)(C)N2Cc3ccc(cc3C2)S(C)(=O)=O)ccc1O
Show InChI InChI=1S/C24H33NO4S/c1-17(2)16-29-23-12-18(6-9-22(23)26)10-11-24(3,4)25-14-19-7-8-21(30(5,27)28)13-20(19)15-25/h6-9,12-13,17,26H,10-11,14-16H2,1-5H3
US Patent
69n/an/an/an/an/an/an/an/a
COGNITION THERAPEUTICS, INC.
US Patent
Assay Description
Radioligand binding assays for Sigma-1 receptors and Sigma-2 receptors were carried out by a commercial contract research organization. For Sigma-1 b...
US Patent US10611728 (2020)
Sigma non-opioid intracellular receptor 1
(Homo sapiens (Human))
BDBM349569
(US10207991, Ex. Cpd. No. 87 | US10611728, Example ...)
Show SMILES CC(C)COc1cc(CCC(C)(C)N2Cc3ccc(cc3C2)S(C)(=O)=O)ccc1O
Show InChI InChI=1S/C24H33NO4S/c1-17(2)16-29-23-12-18(6-9-22(23)26)10-11-24(3,4)25-14-19-7-8-21(30(5,27)28)13-20(19)15-25/h6-9,12-13,17,26H,10-11,14-16H2,1-5H3
US Patent
69n/an/an/an/an/an/an/an/a
COGNITION THERAPEUTICS, INC.
US Patent
Assay Description
The affinity of candidate sigma-2 ligand compounds at sigma-1 and sigma-2 receptors was also determined by displacement of different known labeled si...
US Patent US10207991 (2019)
BindingDB Entry DOI: 10.7270/Q2BV7JRG
Melanin-concentrating hormone receptor 2/HERG
(Homo sapiens (Human))
BDBM349569
(US10207991, Ex. Cpd. No. 87 | US10611728, Example ...)
Show SMILES CC(C)COc1cc(CCC(C)(C)N2Cc3ccc(cc3C2)S(C)(=O)=O)ccc1O
Show InChI InChI=1S/C24H33NO4S/c1-17(2)16-29-23-12-18(6-9-22(23)26)10-11-24(3,4)25-14-19-7-8-21(30(5,27)28)13-20(19)15-25/h6-9,12-13,17,26H,10-11,14-16H2,1-5H3
Reactome pathway
US Patent
n/an/a 570n/an/an/an/an/an/a
COGNITION THERAPEUTICS, INC.
US Patent
Assay Description
Representative sigma-2 antagonists test compounds do not induce neuronal or glial toxicity with acute or chronic dosing in vitro. The sigma-2 recepto...
US Patent US10611728 (2020)