BDBM349587 US10208000, Compound 29
SMILES: CN(c1ccc(Br)cc1)S(=O)(=O)c1ccc2[nH]c(=O)c(=O)[nH]c2c1
InChI Key: InChIKey=SZDWJECNYMCAET-UHFFFAOYSA-N
Data: 1 IC50
Activity Spreadsheet -- Enzyme Inhibition Constant Data from BindingDB
Found 1 hit for monomerid = 349587
Trg + Lig
Ki
nM
ΔG°
kcal/mole
IC50
nM
Kd
nM
EC50/IC50
nM
koff
s-1
kon
M-1s-1
pHTemp
°C
N-acetyltransferase Eis
(Mycobacterium tuberculosis (strain ATCC 25618 / H3...)
BDBM349587
(US10208000, Compound 29)
Show SMILES CN(c1ccc(Br)cc1)S(=O)(=O)c1ccc2[nH]c(=O)c(=O)[nH]c2c1
Show InChI InChI=1S/C15H12BrN3O4S/c1-19(10-4-2-9(16)3-5-10)24(22,23)11-6-7-12-13(8-11)18-15(21)14(20)17-12/h2-8H,1H3,(H,17,20)(H,18,21)
US Patent
n/an/a 80n/an/an/an/an/an/a
University of Kentucky Research Foundation
US Patent
Assay Description
To investigate the potential of these compounds as Eis inhibitors for use in combination with KAN, their biochemical (IC50 values against purified Ei...
US Patent US10208000 (2019)
BindingDB Entry DOI: 10.7270/Q28S4S2Z