null
SMILES: CCc1cccc(c1)N(C)S(=O)(=O)c1ccc2[nH]c(=O)c(=O)[nH]c2c1
InChI Key: InChIKey=YRSYQPIEHABPNF-UHFFFAOYSA-N
Activity Spreadsheet -- Enzyme Inhibition Constant Data from BindingDB
Found 1 hit for monomerid = 349600
Trg + Lig
Ki
nM
ΔG°
kcal/mole
IC50
nM
Kd
nM
EC50/IC50
nM
koff
s-1
kon
M-1s-1
pHTemp
°C
N-acetyltransferase Eis
(Mycobacterium tuberculosis (strain ATCC 25618 / H3...)
BDBM349600
(US10208000, Compound 42)
Show SMILES CCc1cccc(c1)N(C)S(=O)(=O)c1ccc2[nH]c(=O)c(=O)[nH]c2c1
Show InChI InChI=1S/C17H17N3O4S/c1-3-11-5-4-6-12(9-11)20(2)25(23,24)13-7-8-14-15(10-13)19-17(22)16(21)18-14/h4-10H,3H2,1-2H3,(H,18,21)(H,19,22)
US Patent
n/an/a 27n/an/an/an/an/an/a
University of Kentucky Research Foundation
US Patent
Assay Description
To investigate the potential of these compounds as Eis inhibitors for use in combination with KAN, their biochemical (IC50 values against purified Ei...
US Patent US10208000 (2019)
BindingDB Entry DOI: 10.7270/Q28S4S2Z