BDBM349926 US10208020, Example 16::US10538508, Example 16::US9944624, Ex. 16::ethyl (6R)-1′-(5-amino-4H-1,2,4-triazol-3-yl)-6-(4-chlorobenzyl)-[1,4′-bipiperidine]-3-carboxylate
SMILES: CCOC(=O)C1CCC(Cc2ccc(Cl)cc2)N(C1)C1CCN(CC1)c1nnc(N)[nH]1
InChI Key:
Data: 6 IC50
Activity Spreadsheet -- Enzyme Inhibition Constant Data from BindingDB
Found 6 hits for monomerid = 349926
Trg + Lig
Ki
nM
ΔG°
kcal/mole
IC50
nM
Kd
nM
EC50/IC50
nM
koff
s-1
kon
M-1s-1
pHTemp
°C
Acidic mammalian chitinase (AMCase)
(Homo sapiens (Human))
BDBM349926
(US10208020, Example 16 | US10538508, Example 16 | ...)
Show SMILES CCOC(=O)C1CCC(Cc2ccc(Cl)cc2)N(C1)C1CCN(CC1)c1nnc(N)[nH]1
US Patent
n/an/a<100n/an/an/an/an/an/a
OncoArendi Therapeutics S.A.
US Patent
Assay Description
An enzymatic assay with recombinant human AMCase was used in order to establish inhibitory activity of the compounds (Boot et al., 2001, JBC: 276). T...
US Patent US10208020 (2019)
BindingDB Entry DOI: 10.7270/Q2RR21C4
Chitinase 1
(Homo sapiens (Human))
BDBM349926
(US10208020, Example 16 | US10538508, Example 16 | ...)
Show SMILES CCOC(=O)C1CCC(Cc2ccc(Cl)cc2)N(C1)C1CCN(CC1)c1nnc(N)[nH]1
US Patent
n/an/a<100n/an/an/an/an/an/a
OncoArendi Therapeutics S.A.
US Patent
Assay Description
An enzymatic assay with recombinant human CHIT1 was used in order to establish inhibitory activity of the compounds (Boot et al., 2001, JBC: 276). Th...
US Patent US10208020 (2019)
BindingDB Entry DOI: 10.7270/Q2RR21C4
Chitinase 1
(Homo sapiens (Human))
BDBM349926
(US10208020, Example 16 | US10538508, Example 16 | ...)
Show SMILES CCOC(=O)C1CCC(Cc2ccc(Cl)cc2)N(C1)C1CCN(CC1)c1nnc(N)[nH]1
US Patent
n/an/a<100n/an/an/an/an/an/a
OncoArendi Therapeutics S.A.
US Patent
Assay Description
An enzymatic assay with recombinant human CHIT1 was used in order to establish inhibitory activity of the compounds (Boot et al., 2001, JBC: 276). Th...
US Patent US10538508 (2020)
BindingDB Entry DOI: 10.7270/Q2W37ZQC
Chitinase 1
(Homo sapiens (Human))
BDBM349926
(US10208020, Example 16 | US10538508, Example 16 | ...)
Show SMILES CCOC(=O)C1CCC(Cc2ccc(Cl)cc2)N(C1)C1CCN(CC1)c1nnc(N)[nH]1
US Patent
n/an/a<100n/an/an/an/an/an/a
Schering-Plough Research Institute
Assay Description
An enzymatic assay with recombinant human CHIT1 was used in order to establish inhibitory activity of the compounds (Boot et al., 2001, JBC: 276). Th...
Bioorg Med Chem Lett 19: 1164-7 (2009)
BindingDB Entry DOI: 10.7270/Q22N54MD
Acidic mammalian chitinase (AMCase)
(Homo sapiens (Human))
BDBM349926
(US10208020, Example 16 | US10538508, Example 16 | ...)
Show SMILES CCOC(=O)C1CCC(Cc2ccc(Cl)cc2)N(C1)C1CCN(CC1)c1nnc(N)[nH]1
US Patent
n/an/a<100n/an/an/an/an/an/a
OncoArendi Therapeutics S.A.
US Patent
Assay Description
An enzymatic assay with recombinant human AMCase was used in order to establish inhibitory activity of the compounds (Boot et al., 2001, JBC: 276). T...
US Patent US10538508 (2020)
BindingDB Entry DOI: 10.7270/Q2W37ZQC
Acidic mammalian chitinase (AMCase)
(Homo sapiens (Human))
BDBM349926
(US10208020, Example 16 | US10538508, Example 16 | ...)
Show SMILES CCOC(=O)C1CCC(Cc2ccc(Cl)cc2)N(C1)C1CCN(CC1)c1nnc(N)[nH]1
US Patent
n/an/a<100n/an/an/an/an/an/a
Schering-Plough Research Institute
Assay Description
An enzymatic assay with recombinant human AMCase was used in order to establish inhibitory activity of the compounds (Boot et al., 2001, JBC: 276). T...
Bioorg Med Chem Lett 19: 1164-7 (2009)
BindingDB Entry DOI: 10.7270/Q22N54MD