BDBM35016 benzothienopyrimidinone deriv., 14a
SMILES: CN(C)Cc1nc2c3cc(ccc3sc2c(=O)[nH]1)-c1ccccc1
InChI Key: InChIKey=KSFKMCQSTBWUED-UHFFFAOYSA-N
Data: 2 KI
Activity Spreadsheet -- Enzyme Inhibition Constant Data from BindingDB
Found 2 hits for monomerid = 35016
Trg + Lig
Ki
nM
ΔG°
kcal/mole
IC50
nM
Kd
nM
EC50/IC50
nM
koff
s-1
kon
M-1s-1
pHTemp
°C
Serine/threonine-protein kinase pim-1
(Homo sapiens (Human))
BDBM35016
(benzothienopyrimidinone deriv., 14a)
Show SMILES CN(C)Cc1nc2c3cc(ccc3sc2c(=O)[nH]1)-c1ccccc1
Show InChI InChI=1S/C19H17N3OS/c1-22(2)11-16-20-17-14-10-13(12-6-4-3-5-7-12)8-9-15(14)24-18(17)19(23)21-16/h3-10H,11H2,1-2H3,(H,20,21,23)
4 -11.4n/an/an/an/an/an/a25
Abbott Laboratories
Assay Description
In 384-well v-bottom polypropylene plates, compound (2% DMSO) was mixed with Pim kinase and peptide substrate, followed by immediate initiation with ...
J Med Chem 52: 6621-36 (2009)
Article DOI: 10.1021/jm900943h
BindingDB Entry DOI: 10.7270/Q27P8WQW
Serine/threonine-protein kinase pim-2
(Homo sapiens (Human))
BDBM35016
(benzothienopyrimidinone deriv., 14a)
Show SMILES CN(C)Cc1nc2c3cc(ccc3sc2c(=O)[nH]1)-c1ccccc1
Show InChI InChI=1S/C19H17N3OS/c1-22(2)11-16-20-17-14-10-13(12-6-4-3-5-7-12)8-9-15(14)24-18(17)19(23)21-16/h3-10H,11H2,1-2H3,(H,20,21,23)
8 -11.0n/an/an/an/an/an/a25
Abbott Laboratories
Assay Description
In 384-well v-bottom polypropylene plates, compound (2% DMSO) was mixed with Pim kinase and peptide substrate, followed by immediate initiation with ...
J Med Chem 52: 6621-36 (2009)
Article DOI: 10.1021/jm900943h
BindingDB Entry DOI: 10.7270/Q27P8WQW