null
SMILES: CNC(=O)c1cc2c([nH]1)-c1ccncc1OC2(C)C
InChI Key: InChIKey=HQJBUERUDFFUCK-UHFFFAOYSA-N
Activity Spreadsheet -- Enzyme Inhibition Constant Data from BindingDB
Found 3 hits for monomerid = 350171
Trg + Lig
Ki
nM
ΔG°
kcal/mole
IC50
nM
Kd
nM
EC50/IC50
nM
koff
s-1
kon
M-1s-1
pHTemp
°C
Cyclin-C/Cyclin-dependent kinase 8
(Homo sapiens (Human))
BDBM350171
(US10208056, Compound 3)
Show SMILES CNC(=O)c1cc2c([nH]1)-c1ccncc1OC2(C)C
Show InChI InChI=1S/C14H15N3O2/c1-14(2)9-6-10(13(18)15-3)17-12(9)8-4-5-16-7-11(8)19-14/h4-7,17H,1-3H3,(H,15,18)
US Patent
n/an/a 92.2n/an/an/an/an/an/a
FUNDACIÓN DEL SECTOR PÚBLICO ESTATAL CENTRO NACIONAL DE INVESTIGACIONES ONCOLÓGICAS CARLOS III (F.S.P. CNIO)
US Patent
Assay Description
The binding assay relies on the LanthaScreen™ Eu-Kinase Binding Assay (Invitrogen. This is a kinase assay platform based on measuring the binding and...
US Patent US10208056 (2019)
BindingDB Entry DOI: 10.7270/Q2GB266B
Cyclin-C/Cyclin-dependent kinase 19
(Homo sapiens (Human))
BDBM350171
(US10208056, Compound 3)
Show SMILES CNC(=O)c1cc2c([nH]1)-c1ccncc1OC2(C)C
Show InChI InChI=1S/C14H15N3O2/c1-14(2)9-6-10(13(18)15-3)17-12(9)8-4-5-16-7-11(8)19-14/h4-7,17H,1-3H3,(H,15,18)
US Patent
n/an/a 322n/an/an/an/an/an/a
FUNDACIÓN DEL SECTOR PÚBLICO ESTATAL CENTRO NACIONAL DE INVESTIGACIONES ONCOLÓGICAS CARLOS III (F.S.P. CNIO)
US Patent
Assay Description
The binding assay relies on the LanthaScreen™ Eu-Kinase Binding Assay (Invitrogen). This is a kinase assay platform based on measuring the binding an...
US Patent US10208056 (2019)
BindingDB Entry DOI: 10.7270/Q2GB266B
Serine/threonine-protein kinase haspin
(Homo sapiens (Human))
BDBM350171
(US10208056, Compound 3)
Show SMILES CNC(=O)c1cc2c([nH]1)-c1ccncc1OC2(C)C
Show InChI InChI=1S/C14H15N3O2/c1-14(2)9-6-10(13(18)15-3)17-12(9)8-4-5-16-7-11(8)19-14/h4-7,17H,1-3H3,(H,15,18)
US Patent
n/an/a 180n/an/an/an/an/an/a
FUNDACIÓN DEL SECTOR PÚBLICO ESTATAL CENTRO NACIONAL DE INVESTIGACIONES ONCOLÓGICAS CARLOS III (F.S.P. CNIO)
US Patent
Assay Description
The kinase assay relies on ADP-GloKM biochemical kinase assay (Promega). This is a luminescent kinase assay that measures ADP formed from a kinase re...
US Patent US10208056 (2019)
BindingDB Entry DOI: 10.7270/Q2GB266B