null
SMILES: CC1Oc2cnccc2-c2[nH]c(cc12)C(N)=O
InChI Key:
Activity Spreadsheet -- Enzyme Inhibition Constant Data from BindingDB
Found 3 hits for monomerid = 350228
Trg + Lig
Ki
nM
ΔG°
kcal/mole
IC50
nM
Kd
nM
EC50/IC50
nM
koff
s-1
kon
M-1s-1
pHTemp
°C
Cyclin-C/Cyclin-dependent kinase 8
(Homo sapiens (Human))
BDBM350228
(US10208056, Compound 58)
Show SMILES CC1Oc2cnccc2-c2[nH]c(cc12)C(N)=O
US Patent
n/an/a 14.4n/an/an/an/an/an/a
FUNDACIÓN DEL SECTOR PÚBLICO ESTATAL CENTRO NACIONAL DE INVESTIGACIONES ONCOLÓGICAS CARLOS III (F.S.P. CNIO)
US Patent
Assay Description
The binding assay relies on the LanthaScreen™ Eu-Kinase Binding Assay (Invitrogen. This is a kinase assay platform based on measuring the binding and...
US Patent US10208056 (2019)
BindingDB Entry DOI: 10.7270/Q2GB266B
Cyclin-C/Cyclin-dependent kinase 19
(Homo sapiens (Human))
BDBM350228
(US10208056, Compound 58)
Show SMILES CC1Oc2cnccc2-c2[nH]c(cc12)C(N)=O
US Patent
n/an/a 25.5n/an/an/an/an/an/a
FUNDACIÓN DEL SECTOR PÚBLICO ESTATAL CENTRO NACIONAL DE INVESTIGACIONES ONCOLÓGICAS CARLOS III (F.S.P. CNIO)
US Patent
Assay Description
The binding assay relies on the LanthaScreen™ Eu-Kinase Binding Assay (Invitrogen). This is a kinase assay platform based on measuring the binding an...
US Patent US10208056 (2019)
BindingDB Entry DOI: 10.7270/Q2GB266B
Serine/threonine-protein kinase haspin
(Homo sapiens (Human))
BDBM350228
(US10208056, Compound 58)
Show SMILES CC1Oc2cnccc2-c2[nH]c(cc12)C(N)=O
US Patent
n/an/a 247n/an/an/an/an/an/a
FUNDACIÓN DEL SECTOR PÚBLICO ESTATAL CENTRO NACIONAL DE INVESTIGACIONES ONCOLÓGICAS CARLOS III (F.S.P. CNIO)
US Patent
Assay Description
The kinase assay relies on ADP-GloKM biochemical kinase assay (Promega). This is a luminescent kinase assay that measures ADP formed from a kinase re...
US Patent US10208056 (2019)
BindingDB Entry DOI: 10.7270/Q2GB266B