BDBM35023 benzothienopyrimidinone deriv., 14h
SMILES: CCc1ccc(cc1)-c1ccc2sc3c(nc(CN(C)C)[nH]c3=O)c2c1
InChI Key: InChIKey=JSOJYCSDBKJYSB-UHFFFAOYSA-N
Data: 2 KI
Activity Spreadsheet -- Enzyme Inhibition Constant Data from BindingDB
Found 2 hits for monomerid = 35023
Trg + Lig
Ki
nM
ΔG°
kcal/mole
IC50
nM
Kd
nM
EC50/IC50
nM
koff
s-1
kon
M-1s-1
pHTemp
°C
Serine/threonine-protein kinase pim-1
(Homo sapiens (Human))
BDBM35023
(benzothienopyrimidinone deriv., 14h)
Show SMILES CCc1ccc(cc1)-c1ccc2sc3c(nc(CN(C)C)[nH]c3=O)c2c1
Show InChI InChI=1S/C21H21N3OS/c1-4-13-5-7-14(8-6-13)15-9-10-17-16(11-15)19-20(26-17)21(25)23-18(22-19)12-24(2)3/h5-11H,4,12H2,1-3H3,(H,22,23,25)
5 -11.3n/an/an/an/an/an/a25
Abbott Laboratories
Assay Description
In 384-well v-bottom polypropylene plates, compound (2% DMSO) was mixed with Pim kinase and peptide substrate, followed by immediate initiation with ...
J Med Chem 52: 6621-36 (2009)
Article DOI: 10.1021/jm900943h
BindingDB Entry DOI: 10.7270/Q27P8WQW
Serine/threonine-protein kinase pim-2
(Homo sapiens (Human))
BDBM35023
(benzothienopyrimidinone deriv., 14h)
Show SMILES CCc1ccc(cc1)-c1ccc2sc3c(nc(CN(C)C)[nH]c3=O)c2c1
Show InChI InChI=1S/C21H21N3OS/c1-4-13-5-7-14(8-6-13)15-9-10-17-16(11-15)19-20(26-17)21(25)23-18(22-19)12-24(2)3/h5-11H,4,12H2,1-3H3,(H,22,23,25)
12 -10.8n/an/an/an/an/an/a25
Abbott Laboratories
Assay Description
In 384-well v-bottom polypropylene plates, compound (2% DMSO) was mixed with Pim kinase and peptide substrate, followed by immediate initiation with ...
J Med Chem 52: 6621-36 (2009)
Article DOI: 10.1021/jm900943h
BindingDB Entry DOI: 10.7270/Q27P8WQW