BDBM350243 US10208056, Compound 70
SMILES: NC(=O)c1cc2[C@@H](Oc3cnccc3-c2[nH]1)C1CCCCC1
InChI Key:
Data: 3 IC50
Activity Spreadsheet -- Enzyme Inhibition Constant Data from BindingDB
Found 3 hits for monomerid = 350243
Trg + Lig
Ki
nM
ΔG°
kcal/mole
IC50
nM
Kd
nM
EC50/IC50
nM
koff
s-1
kon
M-1s-1
pHTemp
°C
CDK8/Cyclin C
(Homo sapiens (Human))
BDBM350243
(US10208056, Compound 70)
Show SMILES NC(=O)c1cc2[C@@H](Oc3cnccc3-c2[nH]1)C1CCCCC1 |r|
US Patent
n/an/a 8.5n/an/an/an/an/an/a
FUNDACIÓN DEL SECTOR PÚBLICO ESTATAL CENTRO NACIONAL DE INVESTIGACIONES ONCOLÓGICAS CARLOS III (F.S.P. CNIO)
US Patent
Assay Description
The binding assay relies on the LanthaScreen™ Eu-Kinase Binding Assay (Invitrogen. This is a kinase assay platform based on measuring the binding and...
US Patent US10208056 (2019)
BindingDB Entry DOI: 10.7270/Q2GB266B
CDK19/Cyclin C
(Homo sapiens (Human))
BDBM350243
(US10208056, Compound 70)
Show SMILES NC(=O)c1cc2[C@@H](Oc3cnccc3-c2[nH]1)C1CCCCC1 |r|
US Patent
n/an/a 7.14n/an/an/an/an/an/a
FUNDACIÓN DEL SECTOR PÚBLICO ESTATAL CENTRO NACIONAL DE INVESTIGACIONES ONCOLÓGICAS CARLOS III (F.S.P. CNIO)
US Patent
Assay Description
The binding assay relies on the LanthaScreen™ Eu-Kinase Binding Assay (Invitrogen). This is a kinase assay platform based on measuring the binding an...
US Patent US10208056 (2019)
BindingDB Entry DOI: 10.7270/Q2GB266B
Serine/threonine-protein kinase haspin
(Homo sapiens (Human))
BDBM350243
(US10208056, Compound 70)
Show SMILES NC(=O)c1cc2[C@@H](Oc3cnccc3-c2[nH]1)C1CCCCC1 |r|
US Patent
n/an/a 222n/an/an/an/an/an/a
FUNDACIÓN DEL SECTOR PÚBLICO ESTATAL CENTRO NACIONAL DE INVESTIGACIONES ONCOLÓGICAS CARLOS III (F.S.P. CNIO)
US Patent
Assay Description
The kinase assay relies on ADP-GloKM biochemical kinase assay (Promega). This is a luminescent kinase assay that measures ADP formed from a kinase re...
US Patent US10208056 (2019)
BindingDB Entry DOI: 10.7270/Q2GB266B