BDBM35026 benzothienopyrimidinone deriv., 14k
SMILES: CN(C)Cc1nc2c3cc(ccc3sc2c(=O)[nH]1)-c1ccc(N)cc1
InChI Key: InChIKey=GXVGZXNLFFDMQG-UHFFFAOYSA-N
Data: 2 KI
Activity Spreadsheet -- Enzyme Inhibition Constant Data from BindingDB
Found 2 hits for monomerid = 35026
Trg + Lig
Ki
nM
ΔG°
kcal/mole
IC50
nM
Kd
nM
EC50/IC50
nM
koff
s-1
kon
M-1s-1
pHTemp
°C
Serine/threonine-protein kinase pim-2
(Homo sapiens (Human))
BDBM35026
(benzothienopyrimidinone deriv., 14k)
Show SMILES CN(C)Cc1nc2c3cc(ccc3sc2c(=O)[nH]1)-c1ccc(N)cc1
Show InChI InChI=1S/C19H18N4OS/c1-23(2)10-16-21-17-14-9-12(11-3-6-13(20)7-4-11)5-8-15(14)25-18(17)19(24)22-16/h3-9H,10,20H2,1-2H3,(H,21,22,24)
2 -11.9n/an/an/an/an/an/a25
Abbott Laboratories
Assay Description
In 384-well v-bottom polypropylene plates, compound (2% DMSO) was mixed with Pim kinase and peptide substrate, followed by immediate initiation with ...
J Med Chem 52: 6621-36 (2009)
Article DOI: 10.1021/jm900943h
BindingDB Entry DOI: 10.7270/Q27P8WQW
Serine/threonine-protein kinase pim-1
(Homo sapiens (Human))
BDBM35026
(benzothienopyrimidinone deriv., 14k)
Show SMILES CN(C)Cc1nc2c3cc(ccc3sc2c(=O)[nH]1)-c1ccc(N)cc1
Show InChI InChI=1S/C19H18N4OS/c1-23(2)10-16-21-17-14-9-12(11-3-6-13(20)7-4-11)5-8-15(14)25-18(17)19(24)22-16/h3-9H,10,20H2,1-2H3,(H,21,22,24)
2 -11.9n/an/an/an/an/an/a25
Abbott Laboratories
Assay Description
In 384-well v-bottom polypropylene plates, compound (2% DMSO) was mixed with Pim kinase and peptide substrate, followed by immediate initiation with ...
J Med Chem 52: 6621-36 (2009)
Article DOI: 10.1021/jm900943h
BindingDB Entry DOI: 10.7270/Q27P8WQW