BDBM35029 benzothienopyrimidinone deriv., 14n
SMILES: CN(C)Cc1nc2c3cc(ccc3sc2c(=O)[nH]1)-c1ccc(cc1)N(C)C
InChI Key: InChIKey=WQTAETIAWLTMKZ-UHFFFAOYSA-N
Data: 2 KI
Activity Spreadsheet -- Enzyme Inhibition Constant Data from BindingDB
Found 2 hits for monomerid = 35029
Trg + Lig
Ki
nM
ΔG°
kcal/mole
IC50
nM
Kd
nM
EC50/IC50
nM
koff
s-1
kon
M-1s-1
pHTemp
°C
Serine/threonine-protein kinase pim-1
(Homo sapiens (Human))
BDBM35029
(benzothienopyrimidinone deriv., 14n)
Show SMILES CN(C)Cc1nc2c3cc(ccc3sc2c(=O)[nH]1)-c1ccc(cc1)N(C)C
Show InChI InChI=1S/C21H22N4OS/c1-24(2)12-18-22-19-16-11-14(13-5-8-15(9-6-13)25(3)4)7-10-17(16)27-20(19)21(26)23-18/h5-11H,12H2,1-4H3,(H,22,23,26)
4 -11.4n/an/an/an/an/an/a25
Abbott Laboratories
Assay Description
In 384-well v-bottom polypropylene plates, compound (2% DMSO) was mixed with Pim kinase and peptide substrate, followed by immediate initiation with ...
J Med Chem 52: 6621-36 (2009)
Article DOI: 10.1021/jm900943h
BindingDB Entry DOI: 10.7270/Q27P8WQW
Serine/threonine-protein kinase pim-2
(Homo sapiens (Human))
BDBM35029
(benzothienopyrimidinone deriv., 14n)
Show SMILES CN(C)Cc1nc2c3cc(ccc3sc2c(=O)[nH]1)-c1ccc(cc1)N(C)C
Show InChI InChI=1S/C21H22N4OS/c1-24(2)12-18-22-19-16-11-14(13-5-8-15(9-6-13)25(3)4)7-10-17(16)27-20(19)21(26)23-18/h5-11H,12H2,1-4H3,(H,22,23,26)
13 -10.8n/an/an/an/an/an/a25
Abbott Laboratories
Assay Description
In 384-well v-bottom polypropylene plates, compound (2% DMSO) was mixed with Pim kinase and peptide substrate, followed by immediate initiation with ...
J Med Chem 52: 6621-36 (2009)
Article DOI: 10.1021/jm900943h
BindingDB Entry DOI: 10.7270/Q27P8WQW