BDBM350344 (S)-3-(1-((1-acryloylpyrrolidin-3-yl)amino)-8-chloroisoquinolin-3-yl)-1H-1,2,4-triazol-5(4H)-one::US10307414, Example 28::US9801872, Example 28
SMILES: Clc1cccc2cc(nc(N[C@H]3CCN(C3)C(=O)C=C)c12)-c1n[nH]c(=O)[nH]1
InChI Key: InChIKey=ZNZLPDGXJGWQGK-NSHDSACASA-N
Data: 2 IC50
Activity Spreadsheet -- Enzyme Inhibition Constant Data from BindingDB
Found 2 hits for monomerid = 350344
Trg + Lig
Ki
nM
ΔG°
kcal/mole
IC50
nM
Kd
nM
EC50/IC50
nM
koff
s-1
kon
M-1s-1
pHTemp
°C
Tyrosine-protein kinase BTK
(Homo sapiens (Human))
BDBM350344
((S)-3-(1-((1-acryloylpyrrolidin-3-yl)amino)-8-chlo...)
Show SMILES Clc1cccc2cc(nc(N[C@H]3CCN(C3)C(=O)C=C)c12)-c1n[nH]c(=O)[nH]1 |r|
Show InChI InChI=1S/C18H15ClN6O2/c1-2-14(26)25-7-6-11(9-25)20-17-15-10(4-3-5-12(15)19)8-13(21-17)16-22-18(27)24-23-16/h2-5,8,11H,1,6-7,9H2,(H,20,21)/t11-/m0/s1
NCI pathway
Reactome pathway
US Patent
n/an/a<2.51n/an/an/an/an/an/a
CNRS
Assay Description
The inhibitory properties of compounds relative to BTK is determined using a black 384-well-plate format in a buffer which contains 50 mM Hepes, 10 m...
Bioorg Med Chem Lett 19: 1600-3 (2009)
BindingDB Entry DOI: 10.7270/Q2TQ63WG
Tyrosine-protein kinase BTK
(Homo sapiens (Human))
BDBM350344
((S)-3-(1-((1-acryloylpyrrolidin-3-yl)amino)-8-chlo...)
Show SMILES Clc1cccc2cc(nc(N[C@H]3CCN(C3)C(=O)C=C)c12)-c1n[nH]c(=O)[nH]1 |r|
Show InChI InChI=1S/C18H15ClN6O2/c1-2-14(26)25-7-6-11(9-25)20-17-15-10(4-3-5-12(15)19)8-13(21-17)16-22-18(27)24-23-16/h2-5,8,11H,1,6-7,9H2,(H,20,21)/t11-/m0/s1
NCI pathway
Reactome pathway
US Patent
n/an/a<2.51n/an/an/an/an/an/a
Takeda Pharmaceutical Company Limited
US Patent
Assay Description
The inhibitory properties of compounds relative to BTK is determined using a black 384-well-plate format in a buffer which contains 50 mM Hepes, 10 m...
US Patent US9801872 (2017)
BindingDB Entry DOI: 10.7270/Q2BC41PD