BDBM350384 US9802904, 58
SMILES: CC(C)c1ccccc1C1=NCCC(NCc2ccc(cc2)-c2ccccc2)=N1
InChI Key: InChIKey=HDAUDUGYMYCFAO-UHFFFAOYSA-N
Data: 1 IC50
Activity Spreadsheet -- Enzyme Inhibition Constant Data from BindingDB
Found 1 hit for monomerid = 350384
Trg + Lig
Ki
nM
ΔG°
kcal/mole
IC50
nM
Kd
nM
EC50/IC50
nM
koff
s-1
kon
M-1s-1
pHTemp
°C
USP1/UAF1
(Homo sapiens (Human))
BDBM350384
(US9802904, 58)
Show SMILES CC(C)c1ccccc1C1=NCCC(NCc2ccc(cc2)-c2ccccc2)=N1 |c:30,t:10|
Show InChI InChI=1S/C26H27N3/c1-19(2)23-10-6-7-11-24(23)26-27-17-16-25(29-26)28-18-20-12-14-22(15-13-20)21-8-4-3-5-9-21/h3-15,19H,16-18H2,1-2H3,(H,27,28,29)
NCI pathway
Reactome pathway
US Patent
n/an/a 150n/an/an/an/an/an/a
The United States of America, as represented by the Secretary, Department of Health and Human Services; University of Delaware
US Patent
Assay Description
This example demonstrates reversible inhibition of USP1/UAF1 by an embodiment of the invention.The compound (81) at a concentration of ten times its ...
US Patent US9802904 (2017)
BindingDB Entry DOI: 10.7270/Q2TF00H8