null
SMILES: C[C@H](Nc1ncnc2[nH]cc(C#N)c12)c1cc2ncc(Cl)n2nc1-c1ccccc1
InChI Key:
Activity Spreadsheet -- Enzyme Inhibition Constant Data from BindingDB
Found 3 hits for monomerid = 350394
Trg + Lig
Ki
nM
ΔG°
kcal/mole
IC50
nM
Kd
nM
EC50/IC50
nM
koff
s-1
kon
M-1s-1
pHTemp
°C
Phosphatidylinositol 4,5-bisphosphate 3-kinase catalytic subunit delta isoform
(Homo sapiens (Human))
BDBM350394
(US10208066, Compound 9)
Show SMILES C[C@H](Nc1ncnc2[nH]cc(C#N)c12)c1cc2ncc(Cl)n2nc1-c1ccccc1 |r|
NCI pathway
Reactome pathway
US Patent
n/an/a 2n/an/an/an/an/an/a
HUTCHISON MEDIPHARMA LIMITED
US Patent
Assay Description
Briefly, the Transcreener KINASE Assay was designed as a simple two-part, endpoint assay as follows:1) Preparation of 25 uL kinase reaction: the 25 u...
US Patent US10208066 (2019)
BindingDB Entry DOI: 10.7270/Q2319Z0W
Phosphatidylinositol 3-kinase regulatory subunit beta
(Homo sapiens (Human))
BDBM350394
(US10208066, Compound 9)
Show SMILES C[C@H](Nc1ncnc2[nH]cc(C#N)c12)c1cc2ncc(Cl)n2nc1-c1ccccc1 |r|
NCI pathway
Reactome pathway
US Patent
n/an/a 158n/an/an/an/an/an/a
HUTCHISON MEDIPHARMA LIMITED
US Patent
Assay Description
Briefly, the Transcreener KINASE Assay was designed as a simple two-part, endpoint assay as follows:1) Preparation of 25 uL kinase reaction: the 25 u...
US Patent US10208066 (2019)
BindingDB Entry DOI: 10.7270/Q2319Z0W
Phosphatidylinositol 4,5-bisphosphate 3-kinase catalytic subunit gamma isoform
(Homo sapiens (Human))
BDBM350394
(US10208066, Compound 9)
Show SMILES C[C@H](Nc1ncnc2[nH]cc(C#N)c12)c1cc2ncc(Cl)n2nc1-c1ccccc1 |r|
NCI pathway
Reactome pathway
US Patent
n/an/a 46n/an/an/an/an/an/a
HUTCHISON MEDIPHARMA LIMITED
US Patent
Assay Description
Briefly, the Transcreener KINASE Assay was designed as a simple two-part, endpoint assay as follows:1) Preparation of 25 uL kinase reaction: the 25 u...
US Patent US10208066 (2019)
BindingDB Entry DOI: 10.7270/Q2319Z0W