BDBM350399 US10208066, Compound 16::US10611777, Compound 16
SMILES: C[C@H](Nc1ncnc2[nH]cnc12)c1cc2ncc(Cl)n2nc1-c1cccc(F)c1
InChI Key:
Data: 6 IC50
Activity Spreadsheet -- Enzyme Inhibition Constant Data from BindingDB
Found 6 hits for monomerid = 350399
Trg + Lig
Ki
nM
ΔG°
kcal/mole
IC50
nM
Kd
nM
EC50/IC50
nM
koff
s-1
kon
M-1s-1
pHTemp
°C
Phosphatidylinositol 4,5-bisphosphate 3-kinase catalytic subunit delta isoform
(Homo sapiens (Human))
BDBM350399
(US10208066, Compound 16 | US10611777, Compound 16)
Show SMILES C[C@H](Nc1ncnc2[nH]cnc12)c1cc2ncc(Cl)n2nc1-c1cccc(F)c1 |r|
NCI pathway
Reactome pathway
US Patent
n/an/a 3n/an/an/an/an/an/a
HUTCHISON MEDIPHARMA LIMITED
US Patent
Assay Description
Briefly, the Transcreener KINASE Assay was designed as a simple two-part, endpoint assay as follows:1) Preparation of 25 uL kinase reaction: the 25 u...
US Patent US10208066 (2019)
BindingDB Entry DOI: 10.7270/Q2319Z0W
Phosphatidylinositol 4,5-bisphosphate 3-kinase catalytic subunit gamma isoform
(Homo sapiens (Human))
BDBM350399
(US10208066, Compound 16 | US10611777, Compound 16)
Show SMILES C[C@H](Nc1ncnc2[nH]cnc12)c1cc2ncc(Cl)n2nc1-c1cccc(F)c1 |r|
NCI pathway
Reactome pathway
US Patent
n/an/a 326n/an/an/an/an/an/a
HUTCHISON MEDIPHARMA LIMITED
US Patent
Assay Description
Briefly, the Transcreener KINASE Assay was designed as a simple two-part, endpoint assay as follows:1) Preparation of 25 uL kinase reaction: the 25 u...
US Patent US10208066 (2019)
BindingDB Entry DOI: 10.7270/Q2319Z0W
PI3-kinase class I
(Homo sapiens (Human))
BDBM350399
(US10208066, Compound 16 | US10611777, Compound 16)
Show SMILES C[C@H](Nc1ncnc2[nH]cnc12)c1cc2ncc(Cl)n2nc1-c1cccc(F)c1 |r|
US Patent
n/an/a>1.00E+3n/an/an/an/an/an/a
HUTCHISON MEDIPHARMA LIMITED
US Patent
Assay Description
PI3K kinases including p110α/p85α and p110γ were purchased from Invitrogen, p110δ/p85α and p110β/p85α were from Mi...
US Patent US10611777 (2020)
Phosphatidylinositol 4,5-bisphosphate 3-kinase catalytic subunit delta isoform
(Homo sapiens (Human))
BDBM350399
(US10208066, Compound 16 | US10611777, Compound 16)
Show SMILES C[C@H](Nc1ncnc2[nH]cnc12)c1cc2ncc(Cl)n2nc1-c1cccc(F)c1 |r|
NCI pathway
Reactome pathway
US Patent
n/an/a 3n/an/an/an/an/an/a
HUTCHISON MEDIPHARMA LIMITED
US Patent
Assay Description
PI3K kinases including p110α/p85α and p110γ were purchased from Invitrogen, p110δ/p85α and p110β/p85α were from Mi...
US Patent US10611777 (2020)
Phosphatidylinositol 4,5-bisphosphate 3-kinase catalytic subunit gamma isoform
(Homo sapiens (Human))
BDBM350399
(US10208066, Compound 16 | US10611777, Compound 16)
Show SMILES C[C@H](Nc1ncnc2[nH]cnc12)c1cc2ncc(Cl)n2nc1-c1cccc(F)c1 |r|
NCI pathway
Reactome pathway
US Patent
n/an/a 326n/an/an/an/an/an/a
HUTCHISON MEDIPHARMA LIMITED
US Patent
Assay Description
PI3K kinases including p110α/p85α and p110γ were purchased from Invitrogen, p110δ/p85α and p110β/p85α were from Mi...
US Patent US10611777 (2020)
PI3-kinase class I
(Homo sapiens (Human))
BDBM350399
(US10208066, Compound 16 | US10611777, Compound 16)
Show SMILES C[C@H](Nc1ncnc2[nH]cnc12)c1cc2ncc(Cl)n2nc1-c1cccc(F)c1 |r|
US Patent
n/an/a>1.00E+3n/an/an/an/an/an/a
HUTCHISON MEDIPHARMA LIMITED
US Patent
Assay Description
Briefly, the Transcreener KINASE Assay was designed as a simple two-part, endpoint assay as follows:1) Preparation of 25 uL kinase reaction: the 25 u...
US Patent US10208066 (2019)
BindingDB Entry DOI: 10.7270/Q2319Z0W