BDBM35043 benzothienopyrimidinone deriv., 19a
SMILES: Oc1cccc(NCc2nc3c4cc(Br)ccc4sc3c(=O)[nH]2)c1
InChI Key: InChIKey=SLGWCOFFSAFFES-UHFFFAOYSA-N
Data: 2 KI
Activity Spreadsheet -- Enzyme Inhibition Constant Data from BindingDB
Found 2 hits for monomerid = 35043
Trg + Lig
Ki
nM
ΔG°
kcal/mole
IC50
nM
Kd
nM
EC50/IC50
nM
koff
s-1
kon
M-1s-1
pHTemp
°C
Serine/threonine-protein kinase pim-1
(Homo sapiens (Human))
BDBM35043
(benzothienopyrimidinone deriv., 19a)
Show SMILES Oc1cccc(NCc2nc3c4cc(Br)ccc4sc3c(=O)[nH]2)c1
Show InChI InChI=1S/C17H12BrN3O2S/c18-9-4-5-13-12(6-9)15-16(24-13)17(23)21-14(20-15)8-19-10-2-1-3-11(22)7-10/h1-7,19,22H,8H2,(H,20,21,23)
0.800 -12.4n/an/an/an/an/an/a25
Abbott Laboratories
Assay Description
In 384-well v-bottom polypropylene plates, compound (2% DMSO) was mixed with Pim kinase and peptide substrate, followed by immediate initiation with ...
J Med Chem 52: 6621-36 (2009)
Article DOI: 10.1021/jm900943h
BindingDB Entry DOI: 10.7270/Q27P8WQW
Serine/threonine-protein kinase pim-2
(Homo sapiens (Human))
BDBM35043
(benzothienopyrimidinone deriv., 19a)
Show SMILES Oc1cccc(NCc2nc3c4cc(Br)ccc4sc3c(=O)[nH]2)c1
Show InChI InChI=1S/C17H12BrN3O2S/c18-9-4-5-13-12(6-9)15-16(24-13)17(23)21-14(20-15)8-19-10-2-1-3-11(22)7-10/h1-7,19,22H,8H2,(H,20,21,23)
60 -9.85n/an/an/an/an/an/a25
Abbott Laboratories
Assay Description
In 384-well v-bottom polypropylene plates, compound (2% DMSO) was mixed with Pim kinase and peptide substrate, followed by immediate initiation with ...
J Med Chem 52: 6621-36 (2009)
Article DOI: 10.1021/jm900943h
BindingDB Entry DOI: 10.7270/Q27P8WQW