BDBM352011 US9802904, 72
SMILES: CC(C)c1ccccc1-c1ncc(C)c(NCc2ccc(cc2)-c2ccc(C)nc2)n1
InChI Key: InChIKey=OKTDDNGPJVMMAE-UHFFFAOYSA-N
Data: 2 IC50
Activity Spreadsheet -- Enzyme Inhibition Constant Data from BindingDB
Found 2 hits for monomerid = 352011
Trg + Lig
Ki
nM
ΔG°
kcal/mole
IC50
nM
Kd
nM
EC50/IC50
nM
koff
s-1
kon
M-1s-1
pHTemp
°C
Ubiquitin carboxyl-terminal hydrolase 1/WD repeat-containing protein 48
(Homo sapiens (Human))
BDBM352011
(US9802904, 72)
Show SMILES CC(C)c1ccccc1-c1ncc(C)c(NCc2ccc(cc2)-c2ccc(C)nc2)n1
Show InChI InChI=1S/C27H28N4/c1-18(2)24-7-5-6-8-25(24)27-29-15-19(3)26(31-27)30-16-21-10-13-22(14-11-21)23-12-9-20(4)28-17-23/h5-15,17-18H,16H2,1-4H3,(H,29,30,31)
n/an/a 50n/an/an/an/an/an/a
National Center for Advancing Translational Sciences
Curated by ChEMBL
Assay Description
Inhibition of human USP1/UAF1 using Ub-AMC substrate by fluorescence assay
J Med Chem 57: 8099-110 (2014)
Article DOI: 10.1021/jm5010495
BindingDB Entry DOI: 10.7270/Q24X5BSH
USP1/UAF1
(Homo sapiens (Human))
BDBM352011
(US9802904, 72)
Show SMILES CC(C)c1ccccc1-c1ncc(C)c(NCc2ccc(cc2)-c2ccc(C)nc2)n1
Show InChI InChI=1S/C27H28N4/c1-18(2)24-7-5-6-8-25(24)27-29-15-19(3)26(31-27)30-16-21-10-13-22(14-11-21)23-12-9-20(4)28-17-23/h5-15,17-18H,16H2,1-4H3,(H,29,30,31)
NCI pathway
Reactome pathway
US Patent
n/an/a 43n/an/an/an/an/an/a
The United States of America, as represented by the Secretary, Department of Health and Human Services; University of Delaware
US Patent
Assay Description
This example demonstrates reversible inhibition of USP1/UAF1 by an embodiment of the invention.The compound (81) at a concentration of ten times its ...
US Patent US9802904 (2017)
BindingDB Entry DOI: 10.7270/Q2TF00H8