BDBM352021 US9802904, 82
SMILES: CC(C)c1ccccc1-c1ncc(C)c(NCc2ccc(cc2)-c2cnn[nH]2)n1
InChI Key: InChIKey=HHAWHHVAIQFUCJ-UHFFFAOYSA-N
Data: 1 IC50
Activity Spreadsheet -- Enzyme Inhibition Constant Data from BindingDB
Found 1 hit for monomerid = 352021
Trg + Lig
Ki
nM
ΔG°
kcal/mole
IC50
nM
Kd
nM
EC50/IC50
nM
koff
s-1
kon
M-1s-1
pHTemp
°C
USP1/UAF1
(Homo sapiens (Human))
BDBM352021
(US9802904, 82)
Show SMILES CC(C)c1ccccc1-c1ncc(C)c(NCc2ccc(cc2)-c2cnn[nH]2)n1
Show InChI InChI=1S/C23H24N6/c1-15(2)19-6-4-5-7-20(19)23-24-12-16(3)22(27-23)25-13-17-8-10-18(11-9-17)21-14-26-29-28-21/h4-12,14-15H,13H2,1-3H3,(H,24,25,27)(H,26,28,29)
NCI pathway
Reactome pathway
US Patent
n/an/a 240n/an/an/an/an/an/a
The United States of America, as represented by the Secretary, Department of Health and Human Services; University of Delaware
US Patent
Assay Description
This example demonstrates reversible inhibition of USP1/UAF1 by an embodiment of the invention.The compound (81) at a concentration of ten times its ...
US Patent US9802904 (2017)
BindingDB Entry DOI: 10.7270/Q2TF00H8