BDBM35242 3-(phenylsulfonyl)-1H-indole, 18d
SMILES: CCNCCc1cccc2[nH]cc(c12)S(=O)(=O)c1ccccc1
InChI Key: InChIKey=AVHPWUACYYPSMI-UHFFFAOYSA-N
Data: 2 KI  2 IC50
Activity Spreadsheet -- Enzyme Inhibition Constant Data from BindingDB
Found 2 hits for monomerid = 35242
Trg + Lig
Ki
nM
ΔG°
kcal/mole
IC50
nM
Kd
nM
EC50/IC50
nM
koff
s-1
kon
M-1s-1
pHTemp
°C
Sodium-dependent noradrenaline transporter
(Homo sapiens (Human))
BDBM35242
(3-(phenylsulfonyl)-1H-indole, 18d)
Show SMILES CCNCCc1cccc2[nH]cc(c12)S(=O)(=O)c1ccccc1
Show InChI InChI=1S/C18H20N2O2S/c1-2-19-12-11-14-7-6-10-16-18(14)17(13-20-16)23(21,22)15-8-4-3-5-9-15/h3-10,13,19-20H,2,11-12H2,1H3
Reactome pathway
78 -10.1 146n/an/an/an/a7.437
Wyeth Research
Assay Description
Compounds were evaluated the inhibition of [3H] nisoxetine binding to MDCK-Net6 cells, stably transfected with the human norepinephrine transporter (...
Bioorg Med Chem 17: 7802-15 (2009)
Article DOI: 10.1016/j.bmc.2009.09.023
BindingDB Entry DOI: 10.7270/Q26Q1VK2
5-hydroxytryptamine receptor 2A
(Homo sapiens (Human))
BDBM35242
(3-(phenylsulfonyl)-1H-indole, 18d)
Show SMILES CCNCCc1cccc2[nH]cc(c12)S(=O)(=O)c1ccccc1
Show InChI InChI=1S/C18H20N2O2S/c1-2-19-12-11-14-7-6-10-16-18(14)17(13-20-16)23(21,22)15-8-4-3-5-9-15/h3-10,13,19-20H,2,11-12H2,1H3
Reactome pathway
389n/a 1.03E+3n/an/an/an/an/an/a
Wyeth Research
Assay Description
Compounds were evaluated the inhibition of [3H] ketanserin binding to membranes from CHO cells, stably transfected with the human 5-HT2A receptor. Da...
Bioorg Med Chem 17: 7802-15 (2009)
Article DOI: 10.1016/j.bmc.2009.09.023
BindingDB Entry DOI: 10.7270/Q26Q1VK2