null
SMILES: O=C(Nc1cccc(c1)C(=O)Nc1cccc(c1)-c1nc2ccccc2[nH]1)c1ccco1
InChI Key: InChIKey=WFJMXMMPYVXLFE-UHFFFAOYSA-N
Activity Spreadsheet -- Enzyme Inhibition Constant Data from BindingDB
Found 6 hits for monomerid = 35417
Trg + Lig
Ki
nM
ΔG°
kcal/mole
IC50
nM
Kd
nM
EC50/IC50
nM
koff
s-1
kon
M-1s-1
pHTemp
°C
Dual specificity protein phosphatase 1
(Homo sapiens (Human))
BDBM35417
(MLS000089222 | N-[3-({[3-(1H-benzimidazol-2-yl)phe...)
Show SMILES O=C(Nc1cccc(c1)C(=O)Nc1cccc(c1)-c1nc2ccccc2[nH]1)c1ccco1
Show InChI InChI=1S/C25H18N4O3/c30-24(17-7-4-9-19(15-17)27-25(31)22-12-5-13-32-22)26-18-8-3-6-16(14-18)23-28-20-10-1-2-11-21(20)29-23/h1-15H,(H,26,30)(H,27,31)(H,28,29)
NCI pathway
PCBioAssay
n/an/a>5.00E+4n/an/an/an/a7.022
University of Pittsburgh Molecular Library Screening Center
Curated by PubChem BioAssay
Assay Description
The MKP-1 HTS confirmation dose response assay has been developed to confirm actives identified in the MH-76391 In vitro HTS assay for MKP-1 inhibito...
PubChem Bioassay (2007)
BindingDB Entry DOI: 10.7270/Q2F769WQ
Dual specificity protein phosphatase 6
(Rattus norvegicus)
BDBM35417
(MLS000089222 | N-[3-({[3-(1H-benzimidazol-2-yl)phe...)
Show SMILES O=C(Nc1cccc(c1)C(=O)Nc1cccc(c1)-c1nc2ccccc2[nH]1)c1ccco1
Show InChI InChI=1S/C25H18N4O3/c30-24(17-7-4-9-19(15-17)27-25(31)22-12-5-13-32-22)26-18-8-3-6-16(14-18)23-28-20-10-1-2-11-21(20)29-23/h1-15H,(H,26,30)(H,27,31)(H,28,29)
Reactome pathway
PCBioAssay
n/an/a>5.00E+4n/an/an/an/an/an/a
University of Pittsburgh Molecular Library Screening Center
Curated by PubChem BioAssay
Assay Description
The in vitro MKP-3 Phosphatase dose response hit/probe assessment assay has been developed and run at the University of Pittsburgh Molecular Screenin...
PubChem Bioassay (2007)
BindingDB Entry DOI: 10.7270/Q2H70D6B
Dual specificity protein phosphatase 6
(Rattus norvegicus)
BDBM35417
(MLS000089222 | N-[3-({[3-(1H-benzimidazol-2-yl)phe...)
Show SMILES O=C(Nc1cccc(c1)C(=O)Nc1cccc(c1)-c1nc2ccccc2[nH]1)c1ccco1
Show InChI InChI=1S/C25H18N4O3/c30-24(17-7-4-9-19(15-17)27-25(31)22-12-5-13-32-22)26-18-8-3-6-16(14-18)23-28-20-10-1-2-11-21(20)29-23/h1-15H,(H,26,30)(H,27,31)(H,28,29)
Reactome pathway
PCBioAssay
n/an/a 2.50E+3n/an/an/an/an/an/a
Sanford-Burnham Center for Chemical Genomics
Curated by PubChem BioAssay
Assay Description
Data Source: Sanford-Burnham Center for Chemical Genomics (SBCCG) Source Affiliation: Sanford-Burnham Medical Research Institute (SBMRI, San Diego, C...
PubChem Bioassay (2009)
BindingDB Entry DOI: 10.7270/Q2W66J6B
Mitogen-activated protein kinase 10
(Homo sapiens (Human))
BDBM35417
(MLS000089222 | N-[3-({[3-(1H-benzimidazol-2-yl)phe...)
Show SMILES O=C(Nc1cccc(c1)C(=O)Nc1cccc(c1)-c1nc2ccccc2[nH]1)c1ccco1
Show InChI InChI=1S/C25H18N4O3/c30-24(17-7-4-9-19(15-17)27-25(31)22-12-5-13-32-22)26-18-8-3-6-16(14-18)23-28-20-10-1-2-11-21(20)29-23/h1-15H,(H,26,30)(H,27,31)(H,28,29)
NCI pathway
Reactome pathway
PCBioAssay
n/an/a 6.85E+4n/an/an/an/an/an/a
The Scripps Research Institute Molecular Screening Center
Curated by PubChem BioAssay
Assay Description
Source (MLSCN Center Name): The Scripps Research Institute Molecular Screening Center Affiliation: The Scripps Research Institute, TSRI Assay Provide...
PubChem Bioassay (2008)
BindingDB Entry DOI: 10.7270/Q2KK996K
Protein-tyrosine kinase 2-beta
(Homo sapiens (Human))
BDBM35417
(MLS000089222 | N-[3-({[3-(1H-benzimidazol-2-yl)phe...)
Show SMILES O=C(Nc1cccc(c1)C(=O)Nc1cccc(c1)-c1nc2ccccc2[nH]1)c1ccco1
Show InChI InChI=1S/C25H18N4O3/c30-24(17-7-4-9-19(15-17)27-25(31)22-12-5-13-32-22)26-18-8-3-6-16(14-18)23-28-20-10-1-2-11-21(20)29-23/h1-15H,(H,26,30)(H,27,31)(H,28,29)
PCBioAssay
n/an/a 5.03E+3n/an/an/an/an/an/a
The Scripps Research Institute Molecular Screening Center
Curated by PubChem BioAssay
Assay Description
Source (MLPCN Center Name): The Scripps Research Institute Molecular Screening Center (SRIMSC) Affiliation: The Scripps Research Institute, TSRI Assa...
PubChem Bioassay (2009)
BindingDB Entry DOI: 10.7270/Q2H993M3
Focal adhesion kinase 1
(Homo sapiens (Human))
BDBM35417
(MLS000089222 | N-[3-({[3-(1H-benzimidazol-2-yl)phe...)
Show SMILES O=C(Nc1cccc(c1)C(=O)Nc1cccc(c1)-c1nc2ccccc2[nH]1)c1ccco1
Show InChI InChI=1S/C25H18N4O3/c30-24(17-7-4-9-19(15-17)27-25(31)22-12-5-13-32-22)26-18-8-3-6-16(14-18)23-28-20-10-1-2-11-21(20)29-23/h1-15H,(H,26,30)(H,27,31)(H,28,29)
NCI pathway
Reactome pathway
PCBioAssay
n/an/a 5.71E+3n/an/an/an/an/an/a
The Scripps Research Institute Molecular Screening Center
Curated by PubChem BioAssay
Assay Description
Source (MLSCN Center Name): The Scripps Research Institute Molecular Screening Center Center Affiliation: The Scripps Research Institute, TSRI Assa...
PubChem Bioassay (2007)
BindingDB Entry DOI: 10.7270/Q2GX48ZN