null
SMILES: Clc1ccc(cn1)-c1c[nH]n(-c2cc(ncn2)N2CCOCC2)c1=O
InChI Key: InChIKey=RBCIXJQGQNEZRX-UHFFFAOYSA-N
Activity Spreadsheet -- Enzyme Inhibition Constant Data from BindingDB
Found 1 hit for monomerid = 3543
Trg + Lig
Ki
nM
ΔG°
kcal/mole
IC50
nM
Kd
nM
EC50/IC50
nM
koff
s-1
kon
M-1s-1
pHTemp
°C
Transmembrane prolyl 4-hydroxylase
(Homo sapiens (Human))
BDBM3543
(US8524699, 16)
Show SMILES Clc1ccc(cn1)-c1c[nH]n(-c2cc(ncn2)N2CCOCC2)c1=O
Show InChI InChI=1S/C16H15ClN6O2/c17-13-2-1-11(8-18-13)12-9-21-23(16(12)24)15-7-14(19-10-20-15)22-3-5-25-6-4-22/h1-2,7-10,21H,3-6H2
US Patent
n/an/a 480n/an/an/an/a7.525
Bayer Intellectual Property GmbH
US Patent
Assay Description
In Vitro assay determination of the activity and selectivity of HIF Prolyl 4-hydroxylase inhibitors.
US Patent US8524699 (2013)
BindingDB Entry DOI: 10.7270/Q2TB15J4