null
SMILES: FC(F)(F)[C@H]1O[C@H](CSc2ccc(cc2)C#N)CN1c1ccc(C#N)c(c1)C(F)(F)F
InChI Key: InChIKey=UTIFHMHZKMXWMQ-MAUKXSAKSA-N
Activity Spreadsheet -- Enzyme Inhibition Constant Data from BindingDB
Found 1 hit for monomerid = 354717
Trg + Lig
Ki
nM
ΔG°
kcal/mole
IC50
nM
Kd
nM
EC50/IC50
nM
koff
s-1
kon
M-1s-1
pHTemp
°C
Androgen receptor
(Chlorocebus sabaeus (Green monkey) (Cercopithecus ...)
BDBM354717
(Preparation of (S)-2-hydroxy-3-((4-nitro-3-(triflu...)
Show SMILES FC(F)(F)[C@H]1O[C@H](CSc2ccc(cc2)C#N)CN1c1ccc(C#N)c(c1)C(F)(F)F |r|
Show InChI InChI=1S/C20H13F6N3OS/c21-19(22,23)17-7-14(4-3-13(17)9-28)29-10-15(30-18(29)20(24,25)26)11-31-16-5-1-12(8-27)2-6-16/h1-7,15,18H,10-11H2/t15-,18+/m0/s1
US Patent
n/an/a 14.1n/an/an/an/an/an/a
DONG-A ST CO., LTD.
US Patent
Assay Description
In order to examine binding ability of the agonists of the present invention to androgen receptors, the following in-vitro experiment was performed. ...
US Patent US9809583 (2017)
BindingDB Entry DOI: 10.7270/Q2C82CGC