BDBM354728 Preparation of 4-(3-(1H-indol-5-yl)-1H-pyrrolo[2,3-b]pyridin-5-yl)-2-methoxyaniline ::US10485800, Example 5::US9814704, Example 5
SMILES: COc1cc(ccc1N)-c1cnc2[nH]cc(-c3ccc4[nH]ccc4c3)c2c1
InChI Key: InChIKey=RGADUHXKFWBGEA-UHFFFAOYSA-N
Data: 2 IC50
Activity Spreadsheet -- Enzyme Inhibition Constant Data from BindingDB
Found 2 hits for monomerid = 354728
Trg + Lig
Ki
nM
ΔG°
kcal/mole
IC50
nM
Kd
nM
EC50/IC50
nM
koff
s-1
kon
M-1s-1
pHTemp
°C
Mitogen-activated protein kinase kinase kinase 11
(Homo sapiens (Human))
BDBM354728
(Preparation of 4-(3-(1H-indol-5-yl)-1H-pyrrolo[2,3...)
Show SMILES COc1cc(ccc1N)-c1cnc2[nH]cc(-c3ccc4[nH]ccc4c3)c2c1
Show InChI InChI=1S/C22H18N4O/c1-27-21-10-13(2-4-19(21)23)16-9-17-18(12-26-22(17)25-11-16)14-3-5-20-15(8-14)6-7-24-20/h2-12,24H,23H2,1H3,(H,25,26)
NCI pathway
US Patent
n/an/a<100n/an/an/an/an/an/a
The University of Rochester; Board of Regents of the University of Nebraska
US Patent
Assay Description
200 ng (130 nM) MLK3 (Dundee, DU8313) was incubated with 1 μM inactive MKK7b (Dundee, DU703) in the presence of 2 μM cold ATP (Km) and 0.5 ...
US Patent US10485800 (2019)
BindingDB Entry DOI: 10.7270/Q22B91DW
Mitogen-activated protein kinase kinase kinase 11
(Homo sapiens (Human))
BDBM354728
(Preparation of 4-(3-(1H-indol-5-yl)-1H-pyrrolo[2,3...)
Show SMILES COc1cc(ccc1N)-c1cnc2[nH]cc(-c3ccc4[nH]ccc4c3)c2c1
Show InChI InChI=1S/C22H18N4O/c1-27-21-10-13(2-4-19(21)23)16-9-17-18(12-26-22(17)25-11-16)14-3-5-20-15(8-14)6-7-24-20/h2-12,24H,23H2,1H3,(H,25,26)
NCI pathway
US Patent
n/an/a<100n/an/an/an/an/an/a
The University of Rochester
US Patent
Assay Description
200 ng (130 nM) MLK3 (Dundee, DU8313) was incubated with 1 μM inactive MKK7b (Dundee, DU703) in the presence of 2 μM cold ATP (Km) and 0.5 ...
US Patent US9814704 (2017)
BindingDB Entry DOI: 10.7270/Q27H1MRN