BDBM354738 Preparation of 4-(5-(3,4,5-trimethoxyphenyl)-1H-pyrrolo[2,3-b]pyridin-3-yl)aniline ::US10485800, Example 15::US9814704, Example 15
SMILES: COc1cc(cc(OC)c1OC)-c1cnc2[nH]cc(-c3ccc(N)cc3)c2c1
InChI Key: InChIKey=WHSSNVULTAFEGA-UHFFFAOYSA-N
Data: 2 IC50
Activity Spreadsheet -- Enzyme Inhibition Constant Data from BindingDB
Found 2 hits for monomerid = 354738
Trg + Lig
Ki
nM
ΔG°
kcal/mole
IC50
nM
Kd
nM
EC50/IC50
nM
koff
s-1
kon
M-1s-1
pHTemp
°C
Mitogen-activated protein kinase kinase kinase 11
(Homo sapiens (Human))
BDBM354738
(Preparation of 4-(5-(3,4,5-trimethoxyphenyl)-1H-py...)
Show SMILES COc1cc(cc(OC)c1OC)-c1cnc2[nH]cc(-c3ccc(N)cc3)c2c1
Show InChI InChI=1S/C22H21N3O3/c1-26-19-9-14(10-20(27-2)21(19)28-3)15-8-17-18(12-25-22(17)24-11-15)13-4-6-16(23)7-5-13/h4-12H,23H2,1-3H3,(H,24,25)
NCI pathway
US Patent
n/an/a<100n/an/an/an/an/an/a
The University of Rochester; Board of Regents of the University of Nebraska
US Patent
Assay Description
200 ng (130 nM) MLK3 (Dundee, DU8313) was incubated with 1 μM inactive MKK7b (Dundee, DU703) in the presence of 2 μM cold ATP (Km) and 0.5 ...
US Patent US10485800 (2019)
BindingDB Entry DOI: 10.7270/Q22B91DW
Mitogen-activated protein kinase kinase kinase 11
(Homo sapiens (Human))
BDBM354738
(Preparation of 4-(5-(3,4,5-trimethoxyphenyl)-1H-py...)
Show SMILES COc1cc(cc(OC)c1OC)-c1cnc2[nH]cc(-c3ccc(N)cc3)c2c1
Show InChI InChI=1S/C22H21N3O3/c1-26-19-9-14(10-20(27-2)21(19)28-3)15-8-17-18(12-25-22(17)24-11-15)13-4-6-16(23)7-5-13/h4-12H,23H2,1-3H3,(H,24,25)
NCI pathway
US Patent
n/an/a<100n/an/an/an/an/an/a
The University of Rochester
US Patent
Assay Description
200 ng (130 nM) MLK3 (Dundee, DU8313) was incubated with 1 μM inactive MKK7b (Dundee, DU703) in the presence of 2 μM cold ATP (Km) and 0.5 ...
US Patent US9814704 (2017)
BindingDB Entry DOI: 10.7270/Q27H1MRN