null
SMILES: COc1cc(ccc1O)-c1cnc2[nH]c(=O)n(-c3ccc4[nH]ccc4c3)c2n1
InChI Key: InChIKey=FULJPSJYUGLLHI-UHFFFAOYSA-N
Activity Spreadsheet -- Enzyme Inhibition Constant Data from BindingDB
Found 2 hits for monomerid = 354778
Trg + Lig
Ki
nM
ΔG°
kcal/mole
IC50
nM
Kd
nM
EC50/IC50
nM
koff
s-1
kon
M-1s-1
pHTemp
°C
Mitogen-activated protein kinase kinase kinase 11
(Homo sapiens (Human))
BDBM354778
(6-(4-hydroxy-3- methoxyphenyl)-1-(1H- indol-5-yl)-...)
Show SMILES COc1cc(ccc1O)-c1cnc2[nH]c(=O)n(-c3ccc4[nH]ccc4c3)c2n1
Show InChI InChI=1S/C20H15N5O3/c1-28-17-9-11(2-5-16(17)26)15-10-22-18-19(23-15)25(20(27)24-18)13-3-4-14-12(8-13)6-7-21-14/h2-10,21,26H,1H3,(H,22,24,27)
NCI pathway
US Patent
n/an/a<100n/an/an/an/an/an/a
The University of Rochester; Board of Regents of the University of Nebraska
US Patent
Assay Description
200 ng (130 nM) MLK3 (Dundee, DU8313) was incubated with 1 μM inactive MKK7b (Dundee, DU703) in the presence of 2 μM cold ATP (Km) and 0.5 ...
US Patent US10485800 (2019)
BindingDB Entry DOI: 10.7270/Q22B91DW
Mitogen-activated protein kinase kinase kinase 11
(Homo sapiens (Human))
BDBM354778
(6-(4-hydroxy-3- methoxyphenyl)-1-(1H- indol-5-yl)-...)
Show SMILES COc1cc(ccc1O)-c1cnc2[nH]c(=O)n(-c3ccc4[nH]ccc4c3)c2n1
Show InChI InChI=1S/C20H15N5O3/c1-28-17-9-11(2-5-16(17)26)15-10-22-18-19(23-15)25(20(27)24-18)13-3-4-14-12(8-13)6-7-21-14/h2-10,21,26H,1H3,(H,22,24,27)
NCI pathway
US Patent
n/an/a<100n/an/an/an/an/an/a
The University of Rochester
US Patent
Assay Description
200 ng (130 nM) MLK3 (Dundee, DU8313) was incubated with 1 μM inactive MKK7b (Dundee, DU703) in the presence of 2 μM cold ATP (Km) and 0.5 ...
US Patent US9814704 (2017)
BindingDB Entry DOI: 10.7270/Q27H1MRN