null
SMILES: CN1CCN(Cc2ccc(cc2)-c2cnc3ncc(cc23)-c2ccc(cc2)C(N)=O)CC1
InChI Key:
Activity Spreadsheet -- Enzyme Inhibition Constant Data from BindingDB
Found 1 hit for monomerid = 354885
Trg + Lig
Ki
nM
ΔG°
kcal/mole
IC50
nM
Kd
nM
EC50/IC50
nM
koff
s-1
kon
M-1s-1
pHTemp
°C
Mitogen-activated protein kinase kinase kinase 11
(Homo sapiens (Human))
BDBM354885
(US9814704, Example 162)
Show SMILES CN1CCN(Cc2ccc(cc2)-c2cnc3ncc(cc23)-c2ccc(cc2)C(N)=O)CC1
NCI pathway
US Patent
n/an/a<100n/an/an/an/an/an/a
The University of Rochester
US Patent
Assay Description
200 ng (130 nM) MLK3 (Dundee, DU8313) was incubated with 1 μM inactive MKK7b (Dundee, DU703) in the presence of 2 μM cold ATP (Km) and 0.5 ...
US Patent US9814704 (2017)
BindingDB Entry DOI: 10.7270/Q27H1MRN