BDBM35532 symmetric dicoumarol analogue, 8
SMILES: Oc1c(Cc2c(O)c3cc(Cl)ccc3oc2=O)c(=O)oc2ccc(Cl)cc12
InChI Key: InChIKey=PLTAUBVYMSAINB-UHFFFAOYSA-N
Data: 2 IC50
Activity Spreadsheet -- Enzyme Inhibition Constant Data from BindingDB
Found 2 hits for monomerid = 35532
Trg + Lig
Ki
nM
ΔG°
kcal/mole
IC50
nM
Kd
nM
EC50/IC50
nM
koff
s-1
kon
M-1s-1
pHTemp
°C
NAD(P)H dehydrogenase [quinone] 1
(Homo sapiens (Human))
BDBM35532
(symmetric dicoumarol analogue, 8)
Show SMILES Oc1c(Cc2c(O)c3cc(Cl)ccc3oc2=O)c(=O)oc2ccc(Cl)cc12
Show InChI InChI=1S/C19H10Cl2O6/c20-8-1-3-14-10(5-8)16(22)12(18(24)26-14)7-13-17(23)11-6-9(21)2-4-15(11)27-19(13)25/h1-6,22-23H,7H2
Reactome pathway
n/an/a 9n/an/an/an/a7.5n/a
University of Manchester
Assay Description
Recombinant human NQO1 was obtained from Sigma and diluted in 50 mM phosphate buffer to give an absorbance of 0.1 at 550 nm; 5 uL of this solution wa...
J Med Chem 52: 7142-56 (2009)
Article DOI: 10.1021/jm9011609
BindingDB Entry DOI: 10.7270/Q2222S40
NAD(P)H dehydrogenase [quinone] 1
(Homo sapiens (Human))
BDBM35532
(symmetric dicoumarol analogue, 8)
Show SMILES Oc1c(Cc2c(O)c3cc(Cl)ccc3oc2=O)c(=O)oc2ccc(Cl)cc12
Show InChI InChI=1S/C19H10Cl2O6/c20-8-1-3-14-10(5-8)16(22)12(18(24)26-14)7-13-17(23)11-6-9(21)2-4-15(11)27-19(13)25/h1-6,22-23H,7H2
Reactome pathway
n/an/a 6.25E+3n/an/an/an/a7.525
University of Manchester
Assay Description
Recombinant human NQO1 was obtained from Sigma and diluted in 50 mM phosphate buffer to give an absorbance of 0.1 at 550 nm; 5 uL of this solution wa...
J Med Chem 52: 7142-56 (2009)
Article DOI: 10.1021/jm9011609
BindingDB Entry DOI: 10.7270/Q2222S40