BDBM35549 4-hydroxy-2H-chromen-2-one core, 25
SMILES: Oc1c(Cc2cccc3ccccc23)c(=O)oc2ccccc12
InChI Key: InChIKey=PRHLSJVWKOFWSE-UHFFFAOYSA-N
Data: 2 IC50
Activity Spreadsheet -- Enzyme Inhibition Constant Data from BindingDB
Found 2 hits for monomerid = 35549
Trg + Lig
Ki
nM
ΔG°
kcal/mole
IC50
nM
Kd
nM
EC50/IC50
nM
koff
s-1
kon
M-1s-1
pHTemp
°C
NAD(P)H dehydrogenase [quinone] 1
(Homo sapiens (Human))
BDBM35549
(4-hydroxy-2H-chromen-2-one core, 25)
Show SMILES Oc1c(Cc2cccc3ccccc23)c(=O)oc2ccccc12
Show InChI InChI=1S/C20H14O3/c21-19-16-10-3-4-11-18(16)23-20(22)17(19)12-14-8-5-7-13-6-1-2-9-15(13)14/h1-11,21H,12H2
Reactome pathway
n/an/a 24n/an/an/an/a7.5n/a
University of Manchester
Assay Description
Recombinant human NQO1 was obtained from Sigma and diluted in 50 mM phosphate buffer to give an absorbance of 0.1 at 550 nm; 5 uL of this solution wa...
J Med Chem 52: 7142-56 (2009)
Article DOI: 10.1021/jm9011609
BindingDB Entry DOI: 10.7270/Q2222S40
3D
3D Structure (docked)
NAD(P)H dehydrogenase [quinone] 1
(Homo sapiens (Human))
BDBM35549
(4-hydroxy-2H-chromen-2-one core, 25)
Show SMILES Oc1c(Cc2cccc3ccccc23)c(=O)oc2ccccc12
Show InChI InChI=1S/C20H14O3/c21-19-16-10-3-4-11-18(16)23-20(22)17(19)12-14-8-5-7-13-6-1-2-9-15(13)14/h1-11,21H,12H2
Reactome pathway
n/an/a 1.52E+3n/an/an/an/a7.525
University of Manchester
Assay Description
Recombinant human NQO1 was obtained from Sigma and diluted in 50 mM phosphate buffer to give an absorbance of 0.1 at 550 nm; 5 uL of this solution wa...
J Med Chem 52: 7142-56 (2009)
Article DOI: 10.1021/jm9011609
BindingDB Entry DOI: 10.7270/Q2222S40
3D
3D Structure (docked)