BDBM35555 1H-benzo[de]isoquinoline-1,3(2H)-dione, 4
SMILES: OCCNc1ccc2C(=O)N(C(=O)c3cccc1c23)c1ccccc1
InChI Key: InChIKey=MIFATWFHPRFJPQ-UHFFFAOYSA-N
Data: 2 IC50
PDB links: 2 PDB IDs contain this monomer as substructures. 2 PDB IDs contain inhibitors having a similarity of 90% to this monomer.
Activity Spreadsheet -- Enzyme Inhibition Constant Data from BindingDB
Found 2 hits for monomerid = 35555
Trg + Lig
Ki
nM
ΔG°
kcal/mole
IC50
nM
Kd
nM
EC50/IC50
nM
koff
s-1
kon
M-1s-1
pHTemp
°C
HCV NS5B Polymerase
(Hepatitis C virus genotype 2b (isolate HC-J8) (HCV...)
BDBM35555
(1H-benzo[de]isoquinoline-1,3(2H)-dione, 4)
Show SMILES OCCNc1ccc2C(=O)N(C(=O)c3cccc1c23)c1ccccc1
Show InChI InChI=1S/C20H16N2O3/c23-12-11-21-17-10-9-16-18-14(17)7-4-8-15(18)19(24)22(20(16)25)13-5-2-1-3-6-13/h1-10,21,23H,11-12H2
n/an/a>5.00E+4n/an/an/an/an/an/a
IRBM-MRL Rome
Assay Description
Primer-dependent assays were performed using the homopolymeric template/primer. Compounds, polymerase and template RNA were incubated at RT for 25 mi...
J Med Chem 52: 5217-27 (2009)
Article DOI: 10.1021/jm900517t
BindingDB Entry DOI: 10.7270/Q2X928P4
3D
3D Structure (docked)
Non-structural protein 5B (NS5B)
(Hepatitis C virus genotype 1b (isolate BK) (HCV))
BDBM35555
(1H-benzo[de]isoquinoline-1,3(2H)-dione, 4)
Show SMILES OCCNc1ccc2C(=O)N(C(=O)c3cccc1c23)c1ccccc1
Show InChI InChI=1S/C20H16N2O3/c23-12-11-21-17-10-9-16-18-14(17)7-4-8-15(18)19(24)22(20(16)25)13-5-2-1-3-6-13/h1-10,21,23H,11-12H2
n/an/a 1.70E+3n/an/an/an/a7.523
IRBM-MRL Rome
Assay Description
Primer-dependent assays were performed using the homopolymeric template/primer. Compounds, polymerase and template RNA were incubated at RT for 25 mi...
J Med Chem 52: 5217-27 (2009)
Article DOI: 10.1021/jm900517t
BindingDB Entry DOI: 10.7270/Q2X928P4