BDBM35575 pyrazolo pyrimidine, 9
SMILES: COC(=O)Nc1ccc(cc1)-c1nc(N2CCOCC2)c2cnn(C3CCN(Cc4cccnc4)CC3)c2n1
InChI Key: InChIKey=VDOCQQKGPJENHJ-UHFFFAOYSA-N
Data: 4 IC50
Activity Spreadsheet -- Enzyme Inhibition Constant Data from BindingDB
Found 4 hits for monomerid = 35575
Trg + Lig
Ki
nM
ΔG°
kcal/mole
IC50
nM
Kd
nM
EC50/IC50
nM
koff
s-1
kon
M-1s-1
pHTemp
°C
Serine/threonine-protein kinase mTOR
(Homo sapiens (Human))
BDBM35575
(pyrazolo pyrimidine, 9)
Show SMILES COC(=O)Nc1ccc(cc1)-c1nc(N2CCOCC2)c2cnn(C3CCN(Cc4cccnc4)CC3)c2n1
Show InChI InChI=1S/C28H32N8O3/c1-38-28(37)31-22-6-4-21(5-7-22)25-32-26(35-13-15-39-16-14-35)24-18-30-36(27(24)33-25)23-8-11-34(12-9-23)19-20-3-2-10-29-17-20/h2-7,10,17-18,23H,8-9,11-16,19H2,1H3,(H,31,37)
NCI pathway
Reactome pathway
n/an/a 4.60n/an/an/an/a7.423
Wyeth Research
Assay Description
The enzyme was assayed in DELFIA format using purified FLAG-TOR in kinase buffer containing ATP and His6-S6K in the presence of inhibitor compounds. ...
J Med Chem 52: 5013-6 (2009)
Article DOI: 10.1021/jm900851f
BindingDB Entry DOI: 10.7270/Q2SJ1HZD
Phosphatidylinositol 4,5-bisphosphate 3-kinase catalytic subunit alpha isoform
(Homo sapiens (Human))
BDBM35575
(pyrazolo pyrimidine, 9)
Show SMILES COC(=O)Nc1ccc(cc1)-c1nc(N2CCOCC2)c2cnn(C3CCN(Cc4cccnc4)CC3)c2n1
Show InChI InChI=1S/C28H32N8O3/c1-38-28(37)31-22-6-4-21(5-7-22)25-32-26(35-13-15-39-16-14-35)24-18-30-36(27(24)33-25)23-8-11-34(12-9-23)19-20-3-2-10-29-17-20/h2-7,10,17-18,23H,8-9,11-16,19H2,1H3,(H,31,37)
NCI pathway
Reactome pathway
n/an/a 801n/an/an/an/an/an/a
Wyeth Research
Curated by ChEMBL
Assay Description
Inhibition of PI3Kalpha by DELFIA assay
J Med Chem 52: 8010-24 (2009)
Article DOI: 10.1021/jm9013828
BindingDB Entry DOI: 10.7270/Q28W3DGF
Serine/threonine-protein kinase mTOR
(Homo sapiens (Human))
BDBM35575
(pyrazolo pyrimidine, 9)
Show SMILES COC(=O)Nc1ccc(cc1)-c1nc(N2CCOCC2)c2cnn(C3CCN(Cc4cccnc4)CC3)c2n1
Show InChI InChI=1S/C28H32N8O3/c1-38-28(37)31-22-6-4-21(5-7-22)25-32-26(35-13-15-39-16-14-35)24-18-30-36(27(24)33-25)23-8-11-34(12-9-23)19-20-3-2-10-29-17-20/h2-7,10,17-18,23H,8-9,11-16,19H2,1H3,(H,31,37)
NCI pathway
Reactome pathway
n/an/a 4.60n/an/an/an/an/an/a
Wyeth Research
Curated by ChEMBL
Assay Description
Inhibition of human mTOR (1360-2549 amino acids) expressed in HEK293 cells
J Med Chem 52: 8010-24 (2009)
Article DOI: 10.1021/jm9013828
BindingDB Entry DOI: 10.7270/Q28W3DGF
p110α/p85α
(Homo sapiens (Human))
BDBM35575
(pyrazolo pyrimidine, 9)
Show SMILES COC(=O)Nc1ccc(cc1)-c1nc(N2CCOCC2)c2cnn(C3CCN(Cc4cccnc4)CC3)c2n1
Show InChI InChI=1S/C28H32N8O3/c1-38-28(37)31-22-6-4-21(5-7-22)25-32-26(35-13-15-39-16-14-35)24-18-30-36(27(24)33-25)23-8-11-34(12-9-23)19-20-3-2-10-29-17-20/h2-7,10,17-18,23H,8-9,11-16,19H2,1H3,(H,31,37)
n/an/a 801n/an/an/an/an/a25
Wyeth Research
Assay Description
Inhibition of PI3K enzyme activity is measured in a microtiter plate-based fluorescence polarization (FP) assay.
J Med Chem 52: 5013-6 (2009)
Article DOI: 10.1021/jm900851f
BindingDB Entry DOI: 10.7270/Q2SJ1HZD