BDBM35584 pyrazolo pyrimidine, 17
SMILES: CNC(=O)Nc1ccc(cc1)-c1nc(N2CCOCC2)c2cnn(C3CCN(CC3)C(=O)N(C)C)c2n1
InChI Key: InChIKey=VGMKYCYGESGMRO-UHFFFAOYSA-N
Data: 2 IC50
Activity Spreadsheet -- Enzyme Inhibition Constant Data from BindingDB
Found 2 hits for monomerid = 35584
Trg + Lig
Ki
nM
ΔG°
kcal/mole
IC50
nM
Kd
nM
EC50/IC50
nM
koff
s-1
kon
M-1s-1
pHTemp
°C
p110α/p85α
(Homo sapiens (Human))
BDBM35584
(pyrazolo pyrimidine, 17)
Show SMILES CNC(=O)Nc1ccc(cc1)-c1nc(N2CCOCC2)c2cnn(C3CCN(CC3)C(=O)N(C)C)c2n1
Show InChI InChI=1S/C25H33N9O3/c1-26-24(35)28-18-6-4-17(5-7-18)21-29-22(32-12-14-37-15-13-32)20-16-27-34(23(20)30-21)19-8-10-33(11-9-19)25(36)31(2)3/h4-7,16,19H,8-15H2,1-3H3,(H2,26,28,35)
n/an/a 209n/an/an/an/an/a25
Wyeth Research
Assay Description
Inhibition of PI3K enzyme activity is measured in a microtiter plate-based fluorescence polarization (FP) assay.
J Med Chem 52: 5013-6 (2009)
Article DOI: 10.1021/jm900851f
BindingDB Entry DOI: 10.7270/Q2SJ1HZD
Serine/threonine-protein kinase mTOR
(Homo sapiens (Human))
BDBM35584
(pyrazolo pyrimidine, 17)
Show SMILES CNC(=O)Nc1ccc(cc1)-c1nc(N2CCOCC2)c2cnn(C3CCN(CC3)C(=O)N(C)C)c2n1
Show InChI InChI=1S/C25H33N9O3/c1-26-24(35)28-18-6-4-17(5-7-18)21-29-22(32-12-14-37-15-13-32)20-16-27-34(23(20)30-21)19-8-10-33(11-9-19)25(36)31(2)3/h4-7,16,19H,8-15H2,1-3H3,(H2,26,28,35)
NCI pathway
Reactome pathway
n/an/a 1.10n/an/an/an/a7.423
Wyeth Research
Assay Description
The enzyme was assayed in DELFIA format using purified FLAG-TOR in kinase buffer containing ATP and His6-S6K in the presence of inhibitor compounds. ...
J Med Chem 52: 5013-6 (2009)
Article DOI: 10.1021/jm900851f
BindingDB Entry DOI: 10.7270/Q2SJ1HZD