BDBM355863 N-(4-((5-(3-((dimethylamino)methyl)phenyl)pyrrolo[1,2-b]pyridazin-4-yl)oxy)-3-fluorophenyl)-N-(4-fluorophenyl)cyclopropane-1,1-dicarboxamide::US9815840, Example 63
SMILES: CN(C)Cc1cccc(c1)-c1ccn2nccc(Oc3ccc(NC(=O)C4(CC4)C(=O)Nc4ccc(F)cc4)cc3F)c12
InChI Key: InChIKey=QAFJFEPBUYLGCU-UHFFFAOYSA-N
Data: 1 IC50
Activity Spreadsheet -- Enzyme Inhibition Constant Data from BindingDB
Found 1 hit for monomerid = 355863
Trg + Lig
Ki
nM
ΔG°
kcal/mole
IC50
nM
Kd
nM
EC50/IC50
nM
koff
s-1
kon
M-1s-1
pHTemp
°C
Hepatocyte growth factor receptor
(Homo sapiens (Human))
BDBM355863
(N-(4-((5-(3-((dimethylamino)methyl)phenyl)pyrrolo[...)
Show SMILES CN(C)Cc1cccc(c1)-c1ccn2nccc(Oc3ccc(NC(=O)C4(CC4)C(=O)Nc4ccc(F)cc4)cc3F)c12
Show InChI InChI=1S/C33H29F2N5O3/c1-39(2)20-21-4-3-5-22(18-21)26-13-17-40-30(26)29(12-16-36-40)43-28-11-10-25(19-27(28)35)38-32(42)33(14-15-33)31(41)37-24-8-6-23(34)7-9-24/h3-13,16-19H,14-15,20H2,1-2H3,(H,37,41)(H,38,42)
US Patent
n/an/a<40n/an/an/an/an/an/a
The Asan Foundation
US Patent
Assay Description
The inhibitory effect of the compounds of the present invention on the activity of c-Met was confirmed as follows.Specifically, 250 μM G4Y1 pept...
US Patent US9815840 (2017)
BindingDB Entry DOI: 10.7270/Q2862JQZ