BDBM355897 1-(5-chloro-6-(2H- 1,2,3-triazol-2- yl)pyridin-3-yl)-3-(2- chloro-7- isopropylpyrazolo[1, 5-a]pyrimidin-6- yl)urea::US10442808, Example 21::US9815842, Example 21
SMILES: CC(C)c1c(NC(=O)Nc2cnc(c(Cl)c2)-n2nccn2)cnc2cc(Cl)nn12
InChI Key: InChIKey=GSQOTVHUYJQPDR-UHFFFAOYSA-N
Data: 2 IC50
Activity Spreadsheet -- Enzyme Inhibition Constant Data from BindingDB
Found 5 hits for monomerid = 355897
Trg + Lig
Ki
nM
ΔG°
kcal/mole
IC50
nM
Kd
nM
EC50/IC50
nM
koff
s-1
kon
M-1s-1
pHTemp
°C
Mucosa-associated lymphoid tissue lymphoma translocation protein 1
(Homo sapiens (Human))
BDBM355897
(1-(5-chloro-6-(2H- 1,2,3-triazol-2- yl)pyridin-3-y...)
Show SMILES CC(C)c1c(NC(=O)Nc2cnc(c(Cl)c2)-n2nccn2)cnc2cc(Cl)nn12
Show InChI InChI=1S/C17H15Cl2N9O/c1-9(2)15-12(8-20-14-6-13(19)26-27(14)15)25-17(29)24-10-5-11(18)16(21-7-10)28-22-3-4-23-28/h3-9H,1-2H3,(H2,24,25,29)
US Patent
n/an/a 0.00300n/an/an/an/an/an/a
Novartis AG
US Patent
Assay Description
IC50 values of test compounds were determined with an enzyme activity assay using the C-domain of MALT1 (amino acids 329-824). The readout parameter ...
US Patent US9815842 (2017)
BindingDB Entry DOI: 10.7270/Q24F1T0N
Mucosa-associated lymphoid tissue lymphoma translocation protein 1 [329-824]
(Homo sapiens (Human))
BDBM355897
(1-(5-chloro-6-(2H- 1,2,3-triazol-2- yl)pyridin-3-y...)
Show SMILES CC(C)c1c(NC(=O)Nc2cnc(c(Cl)c2)-n2nccn2)cnc2cc(Cl)nn12
Show InChI InChI=1S/C17H15Cl2N9O/c1-9(2)15-12(8-20-14-6-13(19)26-27(14)15)25-17(29)24-10-5-11(18)16(21-7-10)28-22-3-4-23-28/h3-9H,1-2H3,(H2,24,25,29)
NCI pathway
Reactome pathway
US Patent
n/an/a 0.00300n/an/an/an/an/an/a
Novartis AG
US Patent
Assay Description
The assay employs a short peptide substrate labeled with the single fluorophore PT14 as a fluorescence lifetime probe sensitive to the cleavage state...
US Patent US10442808 (2019)
BindingDB Entry DOI: 10.7270/Q2S75JQ3
Mucosa-associated lymphoid tissue lymphoma translocation protein 1
(Homo sapiens (Human))
BDBM355897
(1-(5-chloro-6-(2H- 1,2,3-triazol-2- yl)pyridin-3-y...)
Show SMILES CC(C)c1c(NC(=O)Nc2cnc(c(Cl)c2)-n2nccn2)cnc2cc(Cl)nn12
Show InChI InChI=1S/C17H15Cl2N9O/c1-9(2)15-12(8-20-14-6-13(19)26-27(14)15)25-17(29)24-10-5-11(18)16(21-7-10)28-22-3-4-23-28/h3-9H,1-2H3,(H2,24,25,29)
n/an/a 2.50E+3n/an/an/an/an/an/a
TBA
Citation and Details
Mucosa-associated lymphoid tissue lymphoma translocation protein 1
(Homo sapiens (Human))
BDBM355897
(1-(5-chloro-6-(2H- 1,2,3-triazol-2- yl)pyridin-3-y...)
Show SMILES CC(C)c1c(NC(=O)Nc2cnc(c(Cl)c2)-n2nccn2)cnc2cc(Cl)nn12
Show InChI InChI=1S/C17H15Cl2N9O/c1-9(2)15-12(8-20-14-6-13(19)26-27(14)15)25-17(29)24-10-5-11(18)16(21-7-10)28-22-3-4-23-28/h3-9H,1-2H3,(H2,24,25,29)
n/an/a 140n/an/an/an/an/an/a
TBA
Citation and Details
Mucosa-associated lymphoid tissue lymphoma translocation protein 1
(Homo sapiens (Human))
BDBM355897
(1-(5-chloro-6-(2H- 1,2,3-triazol-2- yl)pyridin-3-y...)
Show SMILES CC(C)c1c(NC(=O)Nc2cnc(c(Cl)c2)-n2nccn2)cnc2cc(Cl)nn12
Show InChI InChI=1S/C17H15Cl2N9O/c1-9(2)15-12(8-20-14-6-13(19)26-27(14)15)25-17(29)24-10-5-11(18)16(21-7-10)28-22-3-4-23-28/h3-9H,1-2H3,(H2,24,25,29)
n/an/a 3n/an/an/an/an/an/a
TBA
Citation and Details