BDBM356064 2-fluoro-N-(2-((2- methoxyacetamido)methyl)-4- phenylpyrimidin-5-yl)-5-(1- methyl-1H-pyrazol-3-yl)-4- (trifluoromethyl)benzamide::US9815846, Compound 64
SMILES: COCC(=O)NCc1ncc(NC(=O)c2cc(-c3ccn(C)n3)c(cc2F)C(F)(F)F)c(n1)-c1ccccc1
InChI Key: InChIKey=GHZHBZRMEKPKSQ-UHFFFAOYSA-N
Data: 1 IC50
Activity Spreadsheet -- Enzyme Inhibition Constant Data from BindingDB
Found 1 hit for monomerid = 356064
Trg + Lig
Ki
nM
ΔG°
kcal/mole
IC50
nM
Kd
nM
EC50/IC50
nM
koff
s-1
kon
M-1s-1
pHTemp
°C
High affinity nerve growth factor receptor
(Homo sapiens (Human))
BDBM356064
(2-fluoro-N-(2-((2- methoxyacetamido)methyl)-4- phe...)
Show SMILES COCC(=O)NCc1ncc(NC(=O)c2cc(-c3ccn(C)n3)c(cc2F)C(F)(F)F)c(n1)-c1ccccc1
Show InChI InChI=1S/C26H22F4N6O3/c1-36-9-8-20(35-36)16-10-17(19(27)11-18(16)26(28,29)30)25(38)33-21-12-31-22(13-32-23(37)14-39-2)34-24(21)15-6-4-3-5-7-15/h3-12H,13-14H2,1-2H3,(H,32,37)(H,33,38)
US Patent
n/an/a 0.440n/an/an/an/an/an/a
Merck Sharp & Dohme Corp.
US Patent
Assay Description
TrkA functional activity was measured using a DiscoverX PathHunter assay. In this assay, U2OS cells express the human TrkA receptor as a fusion with ...
US Patent US9815846 (2017)
BindingDB Entry DOI: 10.7270/Q20P129R