BDBM356095 US9815846, Compound 95
SMILES: CN1CC(=O)N(Cc2ncc(NC(=O)c3cc(-c4ccn(C)n4)c(cc3F)C(F)(F)F)c(n2)-c2ccccc2)C1=O
InChI Key: InChIKey=DYWPXKHCMKFQKJ-UHFFFAOYSA-N
Data: 1 IC50
Activity Spreadsheet -- Enzyme Inhibition Constant Data from BindingDB
Found 1 hit for monomerid = 356095
Trg + Lig
Ki
nM
ΔG°
kcal/mole
IC50
nM
Kd
nM
EC50/IC50
nM
koff
s-1
kon
M-1s-1
pHTemp
°C
High affinity nerve growth factor receptor
(Homo sapiens (Human))
BDBM356095
(US9815846, Compound 95)
Show SMILES CN1CC(=O)N(Cc2ncc(NC(=O)c3cc(-c4ccn(C)n4)c(cc3F)C(F)(F)F)c(n2)-c2ccccc2)C1=O
Show InChI InChI=1S/C27H21F4N7O3/c1-36-14-23(39)38(26(36)41)13-22-32-12-21(24(34-22)15-6-4-3-5-7-15)33-25(40)17-10-16(20-8-9-37(2)35-20)18(11-19(17)28)27(29,30)31/h3-12H,13-14H2,1-2H3,(H,33,40)
US Patent
n/an/a 0.110n/an/an/an/an/an/a
Merck Sharp & Dohme Corp.
US Patent
Assay Description
TrkA functional activity was measured using a DiscoverX PathHunter assay. In this assay, U2OS cells express the human TrkA receptor as a fusion with ...
US Patent US9815846 (2017)
BindingDB Entry DOI: 10.7270/Q20P129R