null
SMILES: Cn1ccc(n1)-c1cc(C(=O)Nc2cc3CCN(Cc3nc2-c2ccccc2)C(N)=O)c(F)cc1C(F)(F)F
InChI Key: InChIKey=QSTKCWODVOZGLR-UHFFFAOYSA-N
Activity Spreadsheet -- Enzyme Inhibition Constant Data from BindingDB
Found 1 hit for monomerid = 356144
Trg + Lig
Ki
nM
ΔG°
kcal/mole
IC50
nM
Kd
nM
EC50/IC50
nM
koff
s-1
kon
M-1s-1
pHTemp
°C
High affinity nerve growth factor receptor
(Homo sapiens (Human))
BDBM356144
(US9815846, Compound 144)
Show SMILES Cn1ccc(n1)-c1cc(C(=O)Nc2cc3CCN(Cc3nc2-c2ccccc2)C(N)=O)c(F)cc1C(F)(F)F
Show InChI InChI=1S/C27H22F4N6O2/c1-36-9-8-21(35-36)17-12-18(20(28)13-19(17)27(29,30)31)25(38)34-22-11-16-7-10-37(26(32)39)14-23(16)33-24(22)15-5-3-2-4-6-15/h2-6,8-9,11-13H,7,10,14H2,1H3,(H2,32,39)(H,34,38)
US Patent
n/an/a 0.260n/an/an/an/an/an/a
Merck Sharp & Dohme Corp.
US Patent
Assay Description
TrkA functional activity was measured using a DiscoverX PathHunter assay. In this assay, U2OS cells express the human TrkA receptor as a fusion with ...
US Patent US9815846 (2017)
BindingDB Entry DOI: 10.7270/Q20P129R