BDBM356215 US9815846, Compound 215
SMILES: Cn1ccc(n1)-c1cc(C(=O)Nc2ccc(nc2-c2ccccc2)C2CNC(=O)N2)c(F)cc1C(F)(F)F
InChI Key: InChIKey=SMDWNHWRCPRZBQ-UHFFFAOYSA-N
Data: 1 IC50
Activity Spreadsheet -- Enzyme Inhibition Constant Data from BindingDB
Found 1 hit for monomerid = 356215
Trg + Lig
Ki
nM
ΔG°
kcal/mole
IC50
nM
Kd
nM
EC50/IC50
nM
koff
s-1
kon
M-1s-1
pHTemp
°C
High affinity nerve growth factor receptor
(Homo sapiens (Human))
BDBM356215
(US9815846, Compound 215)
Show SMILES Cn1ccc(n1)-c1cc(C(=O)Nc2ccc(nc2-c2ccccc2)C2CNC(=O)N2)c(F)cc1C(F)(F)F
Show InChI InChI=1S/C26H20F4N6O2/c1-36-10-9-19(35-36)15-11-16(18(27)12-17(15)26(28,29)30)24(37)33-21-8-7-20(22-13-31-25(38)34-22)32-23(21)14-5-3-2-4-6-14/h2-12,22H,13H2,1H3,(H,33,37)(H2,31,34,38)
US Patent
n/an/a 0.360n/an/an/an/an/an/a
Merck Sharp & Dohme Corp.
US Patent
Assay Description
TrkA functional activity was measured using a DiscoverX PathHunter assay. In this assay, U2OS cells express the human TrkA receptor as a fusion with ...
US Patent US9815846 (2017)
BindingDB Entry DOI: 10.7270/Q20P129R