null
SMILES: Cn1ccc(n1)-c1cc(C(=O)Nc2cnc(CN3CCCOC3=O)nc2-c2ccccc2)c(F)cc1C(F)(F)F
InChI Key: InChIKey=PWVCHIZHIAUAJO-UHFFFAOYSA-N
Activity Spreadsheet -- Enzyme Inhibition Constant Data from BindingDB
Found 1 hit for monomerid = 356222
Trg + Lig
Ki
nM
ΔG°
kcal/mole
IC50
nM
Kd
nM
EC50/IC50
nM
koff
s-1
kon
M-1s-1
pHTemp
°C
High affinity nerve growth factor receptor
(Homo sapiens (Human))
BDBM356222
(2-fluoro-5-(1-methyl-1H- pyrazol-3-yl)-N-(2-((2-ox...)
Show SMILES Cn1ccc(n1)-c1cc(C(=O)Nc2cnc(CN3CCCOC3=O)nc2-c2ccccc2)c(F)cc1C(F)(F)F
Show InChI InChI=1S/C27H22F4N6O3/c1-36-10-8-21(35-36)17-12-18(20(28)13-19(17)27(29,30)31)25(38)33-22-14-32-23(15-37-9-5-11-40-26(37)39)34-24(22)16-6-3-2-4-7-16/h2-4,6-8,10,12-14H,5,9,11,15H2,1H3,(H,33,38)
US Patent
n/an/a 0.220n/an/an/an/an/an/a
Merck Sharp & Dohme Corp.
US Patent
Assay Description
TrkA functional activity was measured using a DiscoverX PathHunter assay. In this assay, U2OS cells express the human TrkA receptor as a fusion with ...
US Patent US9815846 (2017)
BindingDB Entry DOI: 10.7270/Q20P129R