BDBM357 (2R,3R,4R,5R)-2,5-bis[(3,5-difluorophenyl)methoxy]-3,4-dihydroxy-N,N'-bis[(1S)-2-methyl-1-(methylcarbamoyl)propyl]hexanediamide::1-Valine Methylamide deriv. 10::N1,N6-Bis-[(1S)-2-methyl-1-(methylcarbamoyl)propyl]-(2R,3R,4R,5R)-2,5-bis-(3,5-difluorobenzyloxy)-3,4-dihydroxyhexanediamide
SMILES: CNC(=O)[C@@H](NC(=O)[C@H](OCc1cc(F)cc(F)c1)[C@H](O)[C@@H](O)[C@@H](OCc1cc(F)cc(F)c1)C(=O)N[C@@H](C(C)C)C(=O)NC)C(C)C
InChI Key: InChIKey=KDYPVPWYOGIVQF-BQXGFVACSA-N
Data: 1 KI
PDB links: 1 PDB ID contains inhibitors having a similarity of 90% to this monomer.
Activity Spreadsheet -- Enzyme Inhibition Constant Data from BindingDB
Found 1 hit for monomerid = 357
Trg + Lig
Ki
nM
ΔG°
kcal/mole
IC50
nM
Kd
nM
EC50/IC50
nM
koff
s-1
kon
M-1s-1
pHTemp
°C
HIV-1 Protease
(Human immunodeficiency virus type 1)
BDBM357
((2R,3R,4R,5R)-2,5-bis[(3,5-difluorophenyl)methoxy]...)
Show SMILES CNC(=O)[C@@H](NC(=O)[C@H](OCc1cc(F)cc(F)c1)[C@H](O)[C@@H](O)[C@@H](OCc1cc(F)cc(F)c1)C(=O)N[C@@H](C(C)C)C(=O)NC)C(C)C |r|
Show InChI InChI=1S/C32H42F4N4O8/c1-15(2)23(29(43)37-5)39-31(45)27(47-13-17-7-19(33)11-20(34)8-17)25(41)26(42)28(32(46)40-24(16(3)4)30(44)38-6)48-14-18-9-21(35)12-22(36)10-18/h7-12,15-16,23-28,41-42H,13-14H2,1-6H3,(H,37,43)(H,38,44)(H,39,45)(H,40,46)/t23-,24-,25+,26+,27+,28+/m0/s1
1.98 -12.1n/an/an/an/an/a5.030
Linkoping University
Assay Description
A fluorimetric assay was used to determine the effects of the inhibitors on HIV-1 protease. This assay used an internally quenched fluorescent peptid...
J Med Chem 44: 3083-91 (2001)
Article DOI: 10.1021/jm001134q
BindingDB Entry DOI: 10.7270/Q2DZ06GR