BDBM357004 5-Amino-N-(5-chloro-2-pyridyl)-1-(3-fluoro-2-methylphenyl)-3-methyl-pyrazole-4-carboxamide::US10214509, Example 137
SMILES: Cc1nn(c(N)c1C(=O)Nc1ccc(Cl)cn1)-c1cccc(F)c1C
InChI Key: InChIKey=RZGDNQIOOQDAAD-UHFFFAOYSA-N
Data: 2 IC50
Activity Spreadsheet -- Enzyme Inhibition Constant Data from BindingDB
Found 2 hits for monomerid = 357004
Trg + Lig
Ki
nM
ΔG°
kcal/mole
IC50
nM
Kd
nM
EC50/IC50
nM
koff
s-1
kon
M-1s-1
pHTemp
°C
Sodium channel protein type 5 subunit alpha
(Homo sapiens (Human))
BDBM357004
(5-Amino-N-(5-chloro-2-pyridyl)-1-(3-fluoro-2-methy...)
Show SMILES Cc1nn(c(N)c1C(=O)Nc1ccc(Cl)cn1)-c1cccc(F)c1C
Show InChI InChI=1S/C17H15ClFN5O/c1-9-12(19)4-3-5-13(9)24-16(20)15(10(2)23-24)17(25)22-14-7-6-11(18)8-21-14/h3-8H,20H2,1-2H3,(H,21,22,25)
US Patent
n/an/a>3.30E+4n/an/an/an/an/an/a
Almirall, S.A.
US Patent
Assay Description
Cell LinesStable cell lines expressing the full-length protein of the voltage-gated sodium channels Nav1.7 or Nav1.5, with or without one beta-1, bet...
US Patent US10214509 (2019)
BindingDB Entry DOI: 10.7270/Q2FQ9ZWJ
Sodium channel protein type 9 subunit alpha
(Homo sapiens (Human))
BDBM357004
(5-Amino-N-(5-chloro-2-pyridyl)-1-(3-fluoro-2-methy...)
Show SMILES Cc1nn(c(N)c1C(=O)Nc1ccc(Cl)cn1)-c1cccc(F)c1C
Show InChI InChI=1S/C17H15ClFN5O/c1-9-12(19)4-3-5-13(9)24-16(20)15(10(2)23-24)17(25)22-14-7-6-11(18)8-21-14/h3-8H,20H2,1-2H3,(H,21,22,25)
US Patent
n/an/a 600n/an/an/an/an/an/a
Almirall, S.A.
US Patent
Assay Description
Cell LinesStable cell lines expressing the full-length protein of the voltage-gated sodium channels Nav1.7 or Nav1.5, with or without one beta-1, bet...
US Patent US10214509 (2019)
BindingDB Entry DOI: 10.7270/Q2FQ9ZWJ