BDBM357005 5-Amino-1-(2-ethylphenyl)-N-(5-(2,2,2-trifluoroethoxy)pyridin-2-yl)-1H-pyrazole-4-carboxamide::US10214509, Example 140
SMILES: CCc1ccccc1-n1ncc(C(=O)Nc2ccc(OCC(F)(F)F)cn2)c1N
InChI Key: InChIKey=JXHFMOOTGGCGJK-UHFFFAOYSA-N
Data: 2 IC50
Activity Spreadsheet -- Enzyme Inhibition Constant Data from BindingDB
Found 2 hits for monomerid = 357005
Trg + Lig
Ki
nM
ΔG°
kcal/mole
IC50
nM
Kd
nM
EC50/IC50
nM
koff
s-1
kon
M-1s-1
pHTemp
°C
Sodium channel protein type 5 subunit alpha
(Homo sapiens (Human))
BDBM357005
(5-Amino-1-(2-ethylphenyl)-N-(5-(2,2,2-trifluoroeth...)
Show SMILES CCc1ccccc1-n1ncc(C(=O)Nc2ccc(OCC(F)(F)F)cn2)c1N
Show InChI InChI=1S/C19H18F3N5O2/c1-2-12-5-3-4-6-15(12)27-17(23)14(10-25-27)18(28)26-16-8-7-13(9-24-16)29-11-19(20,21)22/h3-10H,2,11,23H2,1H3,(H,24,26,28)
US Patent
n/an/a>3.30E+4n/an/an/an/an/an/a
Almirall, S.A.
US Patent
Assay Description
Cell LinesStable cell lines expressing the full-length protein of the voltage-gated sodium channels Nav1.7 or Nav1.5, with or without one beta-1, bet...
US Patent US10214509 (2019)
BindingDB Entry DOI: 10.7270/Q2FQ9ZWJ
Sodium channel protein type 9 subunit alpha
(Homo sapiens (Human))
BDBM357005
(5-Amino-1-(2-ethylphenyl)-N-(5-(2,2,2-trifluoroeth...)
Show SMILES CCc1ccccc1-n1ncc(C(=O)Nc2ccc(OCC(F)(F)F)cn2)c1N
Show InChI InChI=1S/C19H18F3N5O2/c1-2-12-5-3-4-6-15(12)27-17(23)14(10-25-27)18(28)26-16-8-7-13(9-24-16)29-11-19(20,21)22/h3-10H,2,11,23H2,1H3,(H,24,26,28)
US Patent
n/an/a 1.00E+3n/an/an/an/an/an/a
Almirall, S.A.
US Patent
Assay Description
Cell LinesStable cell lines expressing the full-length protein of the voltage-gated sodium channels Nav1.7 or Nav1.5, with or without one beta-1, bet...
US Patent US10214509 (2019)
BindingDB Entry DOI: 10.7270/Q2FQ9ZWJ