null
SMILES: Cc1nn(c(N)c1C(=O)Nc1ccc(cn1)C(F)(F)F)-c1ccccc1F
InChI Key: InChIKey=DLCCFCROKVWBFD-UHFFFAOYSA-N
Activity Spreadsheet -- Enzyme Inhibition Constant Data from BindingDB
Found 2 hits for monomerid = 357007
Trg + Lig
Ki
nM
ΔG°
kcal/mole
IC50
nM
Kd
nM
EC50/IC50
nM
koff
s-1
kon
M-1s-1
pHTemp
°C
Sodium channel protein type 5 subunit alpha
(Homo sapiens (Human))
BDBM357007
(5-Amino-1-(2-fluorophenyl)-3-methyl-N-(5-(trifluor...)
Show SMILES Cc1nn(c(N)c1C(=O)Nc1ccc(cn1)C(F)(F)F)-c1ccccc1F
Show InChI InChI=1S/C17H13F4N5O/c1-9-14(15(22)26(25-9)12-5-3-2-4-11(12)18)16(27)24-13-7-6-10(8-23-13)17(19,20)21/h2-8H,22H2,1H3,(H,23,24,27)
US Patent
n/an/a>3.30E+4n/an/an/an/an/an/a
Almirall, S.A.
US Patent
Assay Description
Cell LinesStable cell lines expressing the full-length protein of the voltage-gated sodium channels Nav1.7 or Nav1.5, with or without one beta-1, bet...
US Patent US10214509 (2019)
BindingDB Entry DOI: 10.7270/Q2FQ9ZWJ
Sodium channel protein type 9 subunit alpha
(Homo sapiens (Human))
BDBM357007
(5-Amino-1-(2-fluorophenyl)-3-methyl-N-(5-(trifluor...)
Show SMILES Cc1nn(c(N)c1C(=O)Nc1ccc(cn1)C(F)(F)F)-c1ccccc1F
Show InChI InChI=1S/C17H13F4N5O/c1-9-14(15(22)26(25-9)12-5-3-2-4-11(12)18)16(27)24-13-7-6-10(8-23-13)17(19,20)21/h2-8H,22H2,1H3,(H,23,24,27)
US Patent
n/an/a 400n/an/an/an/an/an/a
Almirall, S.A.
US Patent
Assay Description
Cell LinesStable cell lines expressing the full-length protein of the voltage-gated sodium channels Nav1.7 or Nav1.5, with or without one beta-1, bet...
US Patent US10214509 (2019)
BindingDB Entry DOI: 10.7270/Q2FQ9ZWJ