BDBM35718 benzazepine derivative, 20
SMILES: Cc1ccccc1C(=O)Nc1ccc(cc1)C(=O)N1CCCC(O)c2cc(Cl)ccc12
InChI Key: InChIKey=CJXNPZYKFICIJP-UHFFFAOYSA-N
Data: 2 IC50
Activity Spreadsheet -- Enzyme Inhibition Constant Data from BindingDB
Found 2 hits for monomerid = 35718
Trg + Lig
Ki
nM
ΔG°
kcal/mole
IC50
nM
Kd
nM
EC50/IC50
nM
koff
s-1
kon
M-1s-1
pHTemp
°C
Vasopressin V1a receptor
(Homo sapiens (Human))
BDBM35718
(benzazepine derivative, 20)
Show SMILES Cc1ccccc1C(=O)Nc1ccc(cc1)C(=O)N1CCCC(O)c2cc(Cl)ccc12
Show InChI InChI=1S/C25H23ClN2O3/c1-16-5-2-3-6-20(16)24(30)27-19-11-8-17(9-12-19)25(31)28-14-4-7-23(29)21-15-18(26)10-13-22(21)28/h2-3,5-6,8-13,15,23,29H,4,7,14H2,1H3,(H,27,30)
n/an/a 17n/an/an/an/a7.44
Otsuka Pharmaceutical Co., Ltd
Assay Description
After reaching confluence in 12-well or 24-well dishes, the cells were washed twice with ice-cold PBS and incubated for 2 hr with [3H]-AVP at 4 deg C...
Bioorg Med Chem 7: 1743-54 (1999)
Article DOI: 10.1016/s0968-0896(99)00101-7
BindingDB Entry DOI: 10.7270/Q2W957JR
Vasopressin V2 receptor
(Homo sapiens (Human))
BDBM35718
(benzazepine derivative, 20)
Show SMILES Cc1ccccc1C(=O)Nc1ccc(cc1)C(=O)N1CCCC(O)c2cc(Cl)ccc12
Show InChI InChI=1S/C25H23ClN2O3/c1-16-5-2-3-6-20(16)24(30)27-19-11-8-17(9-12-19)25(31)28-14-4-7-23(29)21-15-18(26)10-13-22(21)28/h2-3,5-6,8-13,15,23,29H,4,7,14H2,1H3,(H,27,30)
n/an/a 3n/an/an/an/a7.44
Otsuka Pharmaceutical Co., Ltd
Assay Description
After reaching confluence in 12-well or 24-well dishes, the cells were washed twice with ice-cold PBS and incubated for 2 hr with [3H]-AVP at 4 deg C...
Bioorg Med Chem 7: 1743-54 (1999)
Article DOI: 10.1016/s0968-0896(99)00101-7
BindingDB Entry DOI: 10.7270/Q2W957JR