null
SMILES: OC(=O)COC[C@H]1CC[C@@H](Cn2nc(c(c2SCC#N)-c2ccccc2)-c2ccccc2)CC1
InChI Key: InChIKey=DVZKKBXNFCNCGU-OYRHEFFESA-N
Activity Spreadsheet -- Enzyme Inhibition Constant Data from BindingDB
Found 3 hits for monomerid = 357271
Trg + Lig
Ki
nM
ΔG°
kcal/mole
IC50
nM
Kd
nM
EC50/IC50
nM
koff
s-1
kon
M-1s-1
pHTemp
°C
Prostacyclin receptor
(Homo sapiens (Human))
BDBM357271
(2-(((1s,4s)-4-((5- (cyanomethylthio)-3,4- diphenyl...)
Show SMILES OC(=O)COC[C@H]1CC[C@@H](Cn2nc(c(c2SCC#N)-c2ccccc2)-c2ccccc2)CC1 |r,wU:9.9,6.5,(9.46,-2.31,;8.13,-1.54,;8.13,0,;6.79,-2.31,;5.46,-1.54,;4.13,-2.31,;2.79,-1.54,;1.46,-2.31,;.13,-1.54,;.13,0,;-1.21,.77,;-2.54,0,;-2.77,-1.52,;-4.29,-1.78,;-5,-.41,;-3.92,.69,;-4.32,2.18,;-3.23,3.26,;-3.63,4.75,;-4.03,6.24,;-6.49,-.01,;-6.89,1.48,;-8.37,1.87,;-9.46,.79,;-9.06,-.7,;-7.58,-1.1,;-4.69,-3.26,;-6.17,-3.66,;-6.57,-5.15,;-5.48,-6.24,;-4,-5.84,;-3.6,-4.35,;1.46,.77,;2.79,0,)|
Show InChI InChI=1S/C27H29N3O3S/c28-15-16-34-27-25(22-7-3-1-4-8-22)26(23-9-5-2-6-10-23)29-30(27)17-20-11-13-21(14-12-20)18-33-19-24(31)32/h1-10,20-21H,11-14,16-19H2,(H,31,32)/t20-,21+
NCI pathway
Reactome pathway
US Patent
n/an/an/an/a 11n/an/an/an/a
Arena Pharmaceuticals, Inc.
US Patent
Assay Description
The HTRF assay was carried out using a two-step protocol essentially according to the kit manufacturer's instructions, in 20 μL total volume...
US Patent US10214518 (2019)
BindingDB Entry DOI: 10.7270/Q2T155XG
Prostacyclin receptor
(Homo sapiens (Human))
BDBM357271
(2-(((1s,4s)-4-((5- (cyanomethylthio)-3,4- diphenyl...)
Show SMILES OC(=O)COC[C@H]1CC[C@@H](Cn2nc(c(c2SCC#N)-c2ccccc2)-c2ccccc2)CC1 |r,wU:9.9,6.5,(9.46,-2.31,;8.13,-1.54,;8.13,0,;6.79,-2.31,;5.46,-1.54,;4.13,-2.31,;2.79,-1.54,;1.46,-2.31,;.13,-1.54,;.13,0,;-1.21,.77,;-2.54,0,;-2.77,-1.52,;-4.29,-1.78,;-5,-.41,;-3.92,.69,;-4.32,2.18,;-3.23,3.26,;-3.63,4.75,;-4.03,6.24,;-6.49,-.01,;-6.89,1.48,;-8.37,1.87,;-9.46,.79,;-9.06,-.7,;-7.58,-1.1,;-4.69,-3.26,;-6.17,-3.66,;-6.57,-5.15,;-5.48,-6.24,;-4,-5.84,;-3.6,-4.35,;1.46,.77,;2.79,0,)|
Show InChI InChI=1S/C27H29N3O3S/c28-15-16-34-27-25(22-7-3-1-4-8-22)26(23-9-5-2-6-10-23)29-30(27)17-20-11-13-21(14-12-20)18-33-19-24(31)32/h1-10,20-21H,11-14,16-19H2,(H,31,32)/t20-,21+
NCI pathway
Reactome pathway
n/an/an/an/a 11n/an/an/an/a
TBA
Citation and Details
Major prion protein
(Homo sapiens (Human))
BDBM357271
(2-(((1s,4s)-4-((5- (cyanomethylthio)-3,4- diphenyl...)
Show SMILES OC(=O)COC[C@H]1CC[C@@H](Cn2nc(c(c2SCC#N)-c2ccccc2)-c2ccccc2)CC1 |r,wU:9.9,6.5,(9.46,-2.31,;8.13,-1.54,;8.13,0,;6.79,-2.31,;5.46,-1.54,;4.13,-2.31,;2.79,-1.54,;1.46,-2.31,;.13,-1.54,;.13,0,;-1.21,.77,;-2.54,0,;-2.77,-1.52,;-4.29,-1.78,;-5,-.41,;-3.92,.69,;-4.32,2.18,;-3.23,3.26,;-3.63,4.75,;-4.03,6.24,;-6.49,-.01,;-6.89,1.48,;-8.37,1.87,;-9.46,.79,;-9.06,-.7,;-7.58,-1.1,;-4.69,-3.26,;-6.17,-3.66,;-6.57,-5.15,;-5.48,-6.24,;-4,-5.84,;-3.6,-4.35,;1.46,.77,;2.79,0,)|
Show InChI InChI=1S/C27H29N3O3S/c28-15-16-34-27-25(22-7-3-1-4-8-22)26(23-9-5-2-6-10-23)29-30(27)17-20-11-13-21(14-12-20)18-33-19-24(31)32/h1-10,20-21H,11-14,16-19H2,(H,31,32)/t20-,21+
NCI pathway
Reactome pathway
US Patent
n/an/a 20n/an/an/an/an/an/a
Arena Pharmaceuticals, Inc.
US Patent
Assay Description
Blood collected from healthy human volunteers in aqueous trisodium citrate solution was centrifuged at 150 g for 15 min and the upper layer was recov...
US Patent US10214518 (2019)
BindingDB Entry DOI: 10.7270/Q2T155XG