BDBM3573 8-[(3-Bromophenyl)amino]-1-[2-(dimethylamino)ethyl]-1H-imidazo[4,5-g]quinazoline::Imidazoquinazoline deriv. 11::N-(3-bromophenyl)-1-[2-(dimethylamino)ethyl]-1H-imidazo[4,5-g]quinazolin-8-amine
SMILES: CN(C)CCn1cnc2cc3ncnc(Nc4cccc(Br)c4)c3cc12
InChI Key: InChIKey=FIBRZYOROMWVIM-UHFFFAOYSA-N
Data: 1 IC50
Activity Spreadsheet -- Enzyme Inhibition Constant Data from BindingDB
Found 1 hit for monomerid = 3573
Trg + Lig
Ki
nM
ΔG°
kcal/mole
IC50
nM
Kd
nM
EC50/IC50
nM
koff
s-1
kon
M-1s-1
pHTemp
°C
Epidermal growth factor receptor
(Homo sapiens (Human))
BDBM3573
(8-[(3-Bromophenyl)amino]-1-[2-(dimethylamino)ethyl...)
Show SMILES CN(C)CCn1cnc2cc3ncnc(Nc4cccc(Br)c4)c3cc12
Show InChI InChI=1S/C19H19BrN6/c1-25(2)6-7-26-12-23-17-10-16-15(9-18(17)26)19(22-11-21-16)24-14-5-3-4-13(20)8-14/h3-5,8-12H,6-7H2,1-2H3,(H,21,22,24)
n/an/a 1.32n/an/an/an/a7.422
University of Auckland
Assay Description
IC50 is the inhibitor concentration which inhibits 50% of kinase activity that catalyzes the transfer of the terminal phosphate from [gamma-32P] labe...
J Med Chem 39: 918-28 (1996)
Article DOI: 10.1021/jm950692f
BindingDB Entry DOI: 10.7270/Q2222RZB