BDBM357869 US10214536, Compound 36
SMILES: CC(=O)N1CCC(CC1)c1ccc2oc3nc(N)c(cc3c(=O)c2c1)C(O)=O
InChI Key: InChIKey=JLEKSULAPAVAGH-UHFFFAOYSA-N
Data: 5 IC50
Activity Spreadsheet -- Enzyme Inhibition Constant Data from BindingDB
Found 5 hits for monomerid = 357869
Trg + Lig
Ki
nM
ΔG°
kcal/mole
IC50
nM
Kd
nM
EC50/IC50
nM
koff
s-1
kon
M-1s-1
pHTemp
°C
Protein cereblon/Serine/threonine-protein kinase TBK1
(Homo sapiens (Human))
BDBM357869
(US10214536, Compound 36)
Show SMILES CC(=O)N1CCC(CC1)c1ccc2oc3nc(N)c(cc3c(=O)c2c1)C(O)=O
Show InChI InChI=1S/C20H19N3O5/c1-10(24)23-6-4-11(5-7-23)12-2-3-16-13(8-12)17(25)14-9-15(20(26)27)18(21)22-19(14)28-16/h2-3,8-9,11H,4-7H2,1H3,(H2,21,22)(H,26,27)
US Patent
n/an/a 160n/an/an/an/an/an/a
THE REGENTS OF THE UNIVERSITY OF MICHIGAN
US Patent
Assay Description
Kinase assays are commonly used for determining the ability of a small molecule to inhibit enzyme activity. By measuring the degree of phosphorylatio...
US Patent US10214536 (2019)
BindingDB Entry DOI: 10.7270/Q2N87D2S
Inhibitor of nuclear factor kappa-B kinase subunit epsilon
(Homo sapiens (Human))
BDBM357869
(US10214536, Compound 36)
Show SMILES CC(=O)N1CCC(CC1)c1ccc2oc3nc(N)c(cc3c(=O)c2c1)C(O)=O
Show InChI InChI=1S/C20H19N3O5/c1-10(24)23-6-4-11(5-7-23)12-2-3-16-13(8-12)17(25)14-9-15(20(26)27)18(21)22-19(14)28-16/h2-3,8-9,11H,4-7H2,1H3,(H2,21,22)(H,26,27)
Reactome pathway
n/an/a 1.91E+3n/an/an/an/an/an/a
University of Michigan
Curated by ChEMBL
Assay Description
Inhibition of human IKKepsilon (1 to 655 residues) expressed in Baculovirus infected SF9 insect cells using myelin basic protein as substrate in pres...
Bioorg Med Chem 26: 5443-5461 (2018)
Article DOI: 10.1016/j.bmc.2018.09.020
BindingDB Entry DOI: 10.7270/Q2M04858
Inhibitor of nuclear factor kappa-B kinase subunit epsilon
(Homo sapiens (Human))
BDBM357869
(US10214536, Compound 36)
Show SMILES CC(=O)N1CCC(CC1)c1ccc2oc3nc(N)c(cc3c(=O)c2c1)C(O)=O
Show InChI InChI=1S/C20H19N3O5/c1-10(24)23-6-4-11(5-7-23)12-2-3-16-13(8-12)17(25)14-9-15(20(26)27)18(21)22-19(14)28-16/h2-3,8-9,11H,4-7H2,1H3,(H2,21,22)(H,26,27)
Reactome pathway
n/an/a 1.90E+3n/an/an/an/an/an/a
University of Michigan
Curated by ChEMBL
Assay Description
Inhibition of human IKKepsilon (1 to 655 residues) expressed in Baculovirus infected SF9 insect cells using myelin basic protein as substrate in pres...
Bioorg Med Chem 26: 5443-5461 (2018)
Article DOI: 10.1016/j.bmc.2018.09.020
BindingDB Entry DOI: 10.7270/Q2M04858
Protein cereblon/Serine/threonine-protein kinase TBK1
(Homo sapiens (Human))
BDBM357869
(US10214536, Compound 36)
Show SMILES CC(=O)N1CCC(CC1)c1ccc2oc3nc(N)c(cc3c(=O)c2c1)C(O)=O
Show InChI InChI=1S/C20H19N3O5/c1-10(24)23-6-4-11(5-7-23)12-2-3-16-13(8-12)17(25)14-9-15(20(26)27)18(21)22-19(14)28-16/h2-3,8-9,11H,4-7H2,1H3,(H2,21,22)(H,26,27)
n/an/a 1.70E+4n/an/an/an/an/an/a
University of Michigan
Curated by ChEMBL
Assay Description
Inhibition of human TBK1 (1 to 657 residues) expressed in Baculovirus infected SF9 insect cells using myelin basic protein as substrate in presence o...
Bioorg Med Chem 26: 5443-5461 (2018)
Article DOI: 10.1016/j.bmc.2018.09.020
BindingDB Entry DOI: 10.7270/Q2M04858
Protein cereblon/Serine/threonine-protein kinase TBK1
(Homo sapiens (Human))
BDBM357869
(US10214536, Compound 36)
Show SMILES CC(=O)N1CCC(CC1)c1ccc2oc3nc(N)c(cc3c(=O)c2c1)C(O)=O
Show InChI InChI=1S/C20H19N3O5/c1-10(24)23-6-4-11(5-7-23)12-2-3-16-13(8-12)17(25)14-9-15(20(26)27)18(21)22-19(14)28-16/h2-3,8-9,11H,4-7H2,1H3,(H2,21,22)(H,26,27)
n/an/a 270n/an/an/an/an/an/a
University of Michigan
Curated by ChEMBL
Assay Description
Inhibition of human TBK1 (1 to 657 residues) expressed in Baculovirus infected SF9 insect cells using myelin basic protein as substrate in presence o...
Bioorg Med Chem 26: 5443-5461 (2018)
Article DOI: 10.1016/j.bmc.2018.09.020
BindingDB Entry DOI: 10.7270/Q2M04858