BDBM357872 US10214536, Compound 42
SMILES: Nc1nc2oc3ccc(cc3c(=O)c2cc1C(O)=O)C1CCOCC1
InChI Key: InChIKey=SXKYBRCNSCMDKA-UHFFFAOYSA-N
Data: 3 IC50
Activity Spreadsheet -- Enzyme Inhibition Constant Data from BindingDB
Found 3 hits for monomerid = 357872
Trg + Lig
Ki
nM
ΔG°
kcal/mole
IC50
nM
Kd
nM
EC50/IC50
nM
koff
s-1
kon
M-1s-1
pHTemp
°C
Protein cereblon/Serine/threonine-protein kinase TBK1
(Homo sapiens (Human))
BDBM357872
(US10214536, Compound 42)
Show SMILES Nc1nc2oc3ccc(cc3c(=O)c2cc1C(O)=O)C1CCOCC1
Show InChI InChI=1S/C18H16N2O5/c19-16-13(18(22)23)8-12-15(21)11-7-10(9-3-5-24-6-4-9)1-2-14(11)25-17(12)20-16/h1-2,7-9H,3-6H2,(H2,19,20)(H,22,23)
US Patent
n/an/a 190n/an/an/an/an/an/a
THE REGENTS OF THE UNIVERSITY OF MICHIGAN
US Patent
Assay Description
Kinase assays are commonly used for determining the ability of a small molecule to inhibit enzyme activity. By measuring the degree of phosphorylatio...
US Patent US10214536 (2019)
BindingDB Entry DOI: 10.7270/Q2N87D2S
Protein cereblon/Serine/threonine-protein kinase TBK1
(Homo sapiens (Human))
BDBM357872
(US10214536, Compound 42)
Show SMILES Nc1nc2oc3ccc(cc3c(=O)c2cc1C(O)=O)C1CCOCC1
Show InChI InChI=1S/C18H16N2O5/c19-16-13(18(22)23)8-12-15(21)11-7-10(9-3-5-24-6-4-9)1-2-14(11)25-17(12)20-16/h1-2,7-9H,3-6H2,(H2,19,20)(H,22,23)
n/an/a 750n/an/an/an/an/an/a
University of Michigan
Curated by ChEMBL
Assay Description
Inhibition of human TBK1 (1 to 657 residues) expressed in Baculovirus infected SF9 insect cells using myelin basic protein as substrate in presence o...
Bioorg Med Chem 26: 5443-5461 (2018)
Article DOI: 10.1016/j.bmc.2018.09.020
BindingDB Entry DOI: 10.7270/Q2M04858
Inhibitor of nuclear factor kappa-B kinase subunit epsilon
(Homo sapiens (Human))
BDBM357872
(US10214536, Compound 42)
Show SMILES Nc1nc2oc3ccc(cc3c(=O)c2cc1C(O)=O)C1CCOCC1
Show InChI InChI=1S/C18H16N2O5/c19-16-13(18(22)23)8-12-15(21)11-7-10(9-3-5-24-6-4-9)1-2-14(11)25-17(12)20-16/h1-2,7-9H,3-6H2,(H2,19,20)(H,22,23)
Reactome pathway
n/an/a 1.10E+4n/an/an/an/an/an/a
University of Michigan
Curated by ChEMBL
Assay Description
Inhibition of human IKKepsilon (1 to 655 residues) expressed in Baculovirus infected SF9 insect cells using myelin basic protein as substrate in pres...
Bioorg Med Chem 26: 5443-5461 (2018)
Article DOI: 10.1016/j.bmc.2018.09.020
BindingDB Entry DOI: 10.7270/Q2M04858