BDBM358607 (S)-4-acetyl-1-(5-(4-amino-5-(1- cyclopropyl-1H-pyrazol-4-yl)pyrrolo [2,1-f][1,2,4]triazin-7-yl)-2- fluorophenyl)-3,3,6- trimethylpiperazin-2-one::US10214537, Example 684
SMILES: C[C@H]1CN(C(C)=O)C(C)(C)C(=O)N1c1cc(ccc1F)-c1cc(-c2cnn(c2)C2CC2)c2c(N)ncnn12
InChI Key: InChIKey=OKFYIWRMSCXZEP-HNNXBMFYSA-N
Data: 1 IC50
Activity Spreadsheet -- Enzyme Inhibition Constant Data from BindingDB
Found 1 hit for monomerid = 358607
Trg + Lig
Ki
nM
ΔG°
kcal/mole
IC50
nM
Kd
nM
EC50/IC50
nM
koff
s-1
kon
M-1s-1
pHTemp
°C
Phosphatidylinositol 4,5-bisphosphate 3-kinase catalytic subunit delta isoform
(Homo sapiens (Human))
BDBM358607
((S)-4-acetyl-1-(5-(4-amino-5-(1- cyclopropyl-1H-py...)
Show SMILES C[C@H]1CN(C(C)=O)C(C)(C)C(=O)N1c1cc(ccc1F)-c1cc(-c2cnn(c2)C2CC2)c2c(N)ncnn12 |r|
Show InChI InChI=1S/C27H29FN8O2/c1-15-12-33(16(2)37)27(3,4)26(38)35(15)23-9-17(5-8-21(23)28)22-10-20(24-25(29)30-14-32-36(22)24)18-11-31-34(13-18)19-6-7-19/h5,8-11,13-15,19H,6-7,12H2,1-4H3,(H2,29,30,32)/t15-/m0/s1
NCI pathway
Reactome pathway
US Patent
n/an/a 0.300n/an/an/an/an/an/a
Bristol-Myers Squibb Company
US Patent
Assay Description
The ADP-Glo format PI3K assays were performed in Proxiplate 384-well plates (Perkin Elmer #6008280). The final assay volume was 2 μl prepared fr...
US Patent US10214537 (2019)
BindingDB Entry DOI: 10.7270/Q2HH6NB2