null
SMILES: CC[C@]1(C)N(CCN(C1=O)c1cc(ccc1C#N)-c1cc(c2c(N)ncnn12)C(F)(F)F)C(C)=O
InChI Key: InChIKey=SUWKCHNZMCPEFY-QFIPXVFZSA-N
Activity Spreadsheet -- Enzyme Inhibition Constant Data from BindingDB
Found 1 hit for monomerid = 358613
Trg + Lig
Ki
nM
ΔG°
kcal/mole
IC50
nM
Kd
nM
EC50/IC50
nM
koff
s-1
kon
M-1s-1
pHTemp
°C
Phosphatidylinositol 4,5-bisphosphate 3-kinase catalytic subunit delta isoform
(Homo sapiens (Human))
BDBM358613
((S)-2-(4-acetyl-3-ethyl-3-methyl-2- oxopiperazin-1...)
Show SMILES CC[C@]1(C)N(CCN(C1=O)c1cc(ccc1C#N)-c1cc(c2c(N)ncnn12)C(F)(F)F)C(C)=O |r|
Show InChI InChI=1S/C23H22F3N7O2/c1-4-22(3)21(35)31(7-8-32(22)13(2)34)17-9-14(5-6-15(17)11-27)18-10-16(23(24,25)26)19-20(28)29-12-30-33(18)19/h5-6,9-10,12H,4,7-8H2,1-3H3,(H2,28,29,30)/t22-/m0/s1
NCI pathway
Reactome pathway
US Patent
n/an/a 0.200n/an/an/an/an/an/a
Bristol-Myers Squibb Company
US Patent
Assay Description
The ADP-Glo format PI3K assays were performed in Proxiplate 384-well plates (Perkin Elmer #6008280). The final assay volume was 2 μl prepared fr...
US Patent US10214537 (2019)
BindingDB Entry DOI: 10.7270/Q2HH6NB2