BDBM358684 1-(3-(4-amino-5-chloropyrrolo[2,1-f] [1,2,4]triazin-7-yl)phenyl)-4-(3- hydroxy-3-methylbutanoyl)-3,3- dimethylpiperazin-2-one::US10214537, Example 762
SMILES: CC(C)(O)CC(=O)N1CCN(C(=O)C1(C)C)c1cccc(c1)-c1cc(Cl)c2c(N)ncnn12
InChI Key: InChIKey=LSWYOMHSKRIWPA-UHFFFAOYSA-N
Data: 1 IC50
Activity Spreadsheet -- Enzyme Inhibition Constant Data from BindingDB
Found 1 hit for monomerid = 358684
Trg + Lig
Ki
nM
ΔG°
kcal/mole
IC50
nM
Kd
nM
EC50/IC50
nM
koff
s-1
kon
M-1s-1
pHTemp
°C
Phosphatidylinositol 4,5-bisphosphate 3-kinase catalytic subunit delta isoform
(Homo sapiens (Human))
BDBM358684
(1-(3-(4-amino-5-chloropyrrolo[2,1-f] [1,2,4]triazi...)
Show SMILES CC(C)(O)CC(=O)N1CCN(C(=O)C1(C)C)c1cccc(c1)-c1cc(Cl)c2c(N)ncnn12
Show InChI InChI=1S/C23H27ClN6O3/c1-22(2,33)12-18(31)29-9-8-28(21(32)23(29,3)4)15-7-5-6-14(10-15)17-11-16(24)19-20(25)26-13-27-30(17)19/h5-7,10-11,13,33H,8-9,12H2,1-4H3,(H2,25,26,27)
NCI pathway
Reactome pathway
US Patent
n/an/a 0.200n/an/an/an/an/an/a
Bristol-Myers Squibb Company
US Patent
Assay Description
The ADP-Glo format PI3K assays were performed in Proxiplate 384-well plates (Perkin Elmer #6008280). The final assay volume was 2 μl prepared fr...
US Patent US10214537 (2019)
BindingDB Entry DOI: 10.7270/Q2HH6NB2